{"text_format":"1","workbook":"xlsx","n_sheets":7,"sheets":["DADOS","BDI (1)","BDI (2)","BDI (3)","PO","PLQ","CFF"],"not_rendered":{"charts":0,"images":19,"macros":1,"external_links":0,"defined_names":184,"comments":0,"pivot_tables":0},"unopened":[],"bounds":{"document_bytes":16777216,"sheet_cells":100000,"rows_first":2000,"rows_last":500,"rows_between":2000,"halvings":0,"cell_chars":16384,"cell_head_chars":4096},"cells_cut":0,"cells_raw":0,"read":"whole","date_system":"1900"}

{"sheet":"DADOS","index":0,"n_rows":230,"n_cols":24,"rows_kept":230,"cut":false,"hidden":false,"merged":[[37,6,37,18],[85,0,85,23],[37,3,37,5],[41,2,41,6],[67,0,67,23],[77,0,77,23],[70,0,70,23],[71,0,71,23],[15,0,15,23],[17,0,17,23],[21,0,21,8],[75,0,75,23],[83,0,83,23],[76,0,76,23],[78,0,78,23],[81,0,81,23],[219,9,219,14],[98,0,98,23],[97,0,97,23],[96,0,96,23],[25,0,25,23],[27,0,27,1],[28,0,28,1],[68,0,68,23],[59,0,59,23],[61,0,61,23],[100,0,100,23],[94,0,94,23],[95,0,95,23],[37,0,37,1],[41,20,41,21],[69,0,69,23],[39,0,39,23],[99,0,99,23],[73,0,73,23],[80,0,80,23],[89,0,89,23],[92,0,92,23],[93,0,93,23],[91,0,91,23],[0,1,1,23],[55,7,55,10],[41,22,41,23],[36,0,36,1],[41,0,41,1],[42,22,42,23],[42,14,42,19],[42,2,42,6],[41,10,41,12],[42,20,42,21],[34,0,34,23],[36,6,36,18],[36,3,36,5],[3,0,3,23],[5,0,5,23],[7,0,7,23],[23,0,23,23],[13,0,13,23],[9,0,9,23],[11,0,11,23],[41,7,41,8],[55,1,55,4],[41,14,41,19],[42,0,42,1],[223,0,223,5],[223,6,223,9],[222,6,222,9],[219,2,219,4],[86,0,86,23],[228,22,228,23],[228,20,228,21],[42,7,42,8],[226,0,226,1],[225,6,225,18],[225,0,225,1],[219,0,219,1],[226,3,226,5],[47,0,47,2],[56,7,56,10],[53,1,53,4],[64,0,64,23],[54,7,54,10],[44,0,44,23],[62,0,62,23],[49,0,49,23],[54,1,54,4],[56,1,56,4],[53,7,53,10],[229,14,229,19],[228,7,228,8],[228,10,228,12],[228,14,228,19],[229,22,229,23],[223,16,223,23],[222,10,222,15],[79,0,79,23],[82,0,82,23],[229,0,229,1],[229,20,229,21],[229,10,229,12],[220,9,220,14],[226,6,226,18],[228,0,228,1],[228,2,228,6],[229,2,229,6],[229,7,229,8],[223,10,223,15],[222,16,222,23],[225,3,225,5],[84,0,84,23],[220,0,220,1],[222,0,222,5],[220,2,220,4],[219,5,219,8],[220,5,220,8],[219,15,219,23],[220,15,220,23],[27,9,27,14],[31,6,31,9],[30,10,30,15],[31,10,31,15],[27,15,27,23],[30,16,30,23],[31,16,31,23],[30,0,30,5],[27,2,27,4],[28,2,28,4],[27,5,27,8],[28,5,28,8],[31,0,31,5],[30,6,30,9],[28,15,28,23],[28,9,28,14],[66,0,66,23],[87,0,87,23],[42,10,42,12]]}
[27476,"PO - Planilha Orçamentária / PLQ - Planilha de Levantamento de Quantidades / CFF - Cronograma Físico Financeiro"]
["v006"]
[]
["INSTRUÇÕES DE USO E PREENCHIMENTO"]
[]
["1. Este documento somente pode ser utilizado nas versões do Excel 2003 ou superior. Não deve ser utilizado versões do BROffice. O Documento deve ser salvo SOMENTE em extensão habilitada para macros (.xls ou .xlsm). Se o documento for salvo na extensão .xlsx, o arquivo será INUTILIZADO. "]
[]
["2. Para funcionamento pleno desse arquivo, a Segurança de Macros do Excel deve ser habilitada."]
[]
["2.1  Na Versão Excel 2003, selecione na Faixa de Opções: Ferramentas --> Macro --> Segurança --> Na aba Nível de Segurança selecione a Opção \"Baixo\" --> Clique em OK --> Feche e abra o Excel novamente para utilizar a Planilha."]
[]
["2.2 Na Versão Excel 2007 ou superior, selecione na Faixa de Opções: Arquivo --> Opções --> Central de Confiabilidade --> Configurações da Central de Confiabilidade --> Configurações de Macro --> Habilitar todas as Macros --> Clique em OK --> Feche e abra o excel novamente para utilizar a Planilha."]
[]
["3. O Preenchimento deve ser feito somente nas células em amarelo. As outras células são de preenchimento Automático."]
[]
["4. Preferências de Elaboração do Orçamento"]
[]
["4.1. Preenchimento de Quantidades"]
[]
[]
[]
["5. Ordem de Preenchimento"]
[]
["5.1. na Aba DADOS"]
[]
["5.1.1. Preencha no Quadro abaixo os Dados do TC/CR:"]
[]
["Nº OPERAÇÃO",null,"GESTOR",null,null,"PROGRAMA",null,null,null,"AÇÃO / MODALIDADE",null,null,null,null,null,"OBJETO"]
["1.041.962-43/2017",null,"MAPA",null,null,"PRODESA",null,null,null,"CONSTRUÇÃO DE EDIFICAÇÃO",null,null,null,null,null,"CONSTRUÇÃO DA CASA DO PRODUTOR"]
[]
["PROPONENTE / TOMADOR",null,null,null,null,null,"MUNICÍPIO / UF",null,null,null,"LOCALIDADE / ENDEREÇO",null,null,null,null,null,"APELIDO DO EMPREENDIMENTO"]
["PREFEITURA MUNICIPAL DE VARGEM BONITA/SC",null,null,null,null,null,"VARGEM BONITA/SC",null,null,null,"TRAVESSA LUIZ SALVADOR/ CENTRO",null,null,null,null,null,"CASA DO PRODUTOR_VBO"]
[]
[]
["5.1.2. Preencha no quadro abaixo as informações sobre o orçamento:"]
[]
["DATA BASE",null,"DESON.","LOCALIDADE DO SINAPI",null,null,"DESCRIÇÃO DO LOTE",null,null,null,null,null,null,null,null,null,null,null,null,"BDI 1","BDI 2","BDI 3","BDI 4","BDI 5"]
["2018-06-01",null,"Sim","Florianópolis / SC",null,null,null,null,null,null,null,null,null,null,null,null,null,null,null,{"$f":"IF(ISERROR(INDIRECT(\"'BDI (\"&RIGHT(T37,1)&\")'!N27\")),\"\",INDIRECT(\"'BDI (\"&RIGHT(T37,1)&\")'!N27\"))","v":0.26519999999999999},{"$f":"IF(ISERROR(INDIRECT(\"'BDI (\"&RIGHT(U37,1)&\")'!N27\")),\"\",INDIRECT(\"'BDI (\"&RIGHT(U37,1)&\")'!N27\"))","v":0},{"$f":"IF(ISERROR(INDIRECT(\"'BDI (\"&RIGHT(V37,1)&\")'!N27\")),\"\",INDIRECT(\"'BDI (\"&RIGHT(V37,1)&\")'!N27\"))","v":0},{"$f":"IF(ISERROR(INDIRECT(\"'BDI (\"&RIGHT(W37,1)&\")'!N27\")),\"\",INDIRECT(\"'BDI (\"&RIGHT(W37,1)&\")'!N27\"))","v":""},{"$f":"IF(ISERROR(INDIRECT(\"'BDI (\"&RIGHT(X37,1)&\")'!N27\")),\"\",INDIRECT(\"'BDI (\"&RIGHT(X37,1)&\")'!N27\"))","v":""}]
[]
["4.1.2. Preencha no quadro abaixo as informações sobre o orçamento licitado:"]
[]
["CTEF n.º",null,"NOME DA EMPRESA ",null,null,null,null,"DATA BASE",null,"DESON.","REGIME DE EXECUÇÃO",null,null,"ACOMP.","OBJETO CTEF",null,null,null,null,null,"DATA ASSINATURA",null,"VIGÊNCIA"]
[]
[]
["5.1.3. Preencha a data de Início da Obra:"]
[]
["DATA INÍCIO"]
["2018-11-01"]
[]
["5.1.4. Preencha no(s) Quadro(s) abaixo os Dados do(s) Responsável(is) Técnico(s) pela elaboração do Orçamento:"]
[]
[null,null,null,null,null,null,"Exibir o 2° Quadro de Assinatura?",null,null,null,"NÃO"]
[]
["Nome:","MAX MOOSHAMMER",null,null,null,null,"Nome:"]
[{"$f":"IF(OR(TipoOrçamento=\"BASE\",TipoOrçamento=\"REPROGRAMADONPL\"),\"Título:\",\"Cargo:\")","v":"Título:"},"ENGENHEIRO CIVIL",null,null,null,null,{"$f":"A55","v":"Título:"}]
[{"$f":"IF(OR(TipoOrçamento=\"BASE\",TipoOrçamento=\"REPROGRAMADONPL\"),\"CREA/CAU:\",\"Empresa:\")","v":"CREA/CAU:"},"139.164-0",null,null,null,null,{"$f":"A56","v":"CREA/CAU:"}]
[{"$f":"IF(OR(TipoOrçamento=\"BASE\",TipoOrçamento=\"REPROGRAMADONPL\"),\"ART/RRT:\",\"CNPJ:\")","v":"ART/RRT:"},"6699689-7",null,null,null,null,{"$f":"A57","v":"ART/RRT:"}]
[]
[]
["5.2. Legenda das Abas"]
[]
["5.2.1.  LARANJA: Aba DADOS. Preenchimento Obrigatório. Impressão Dispensada."]
["5.2.2.  AMARELO: Abas BDI, PO, PLQ e CFF. Preenchimento e Impressão Obrigatórias. O preenchimento da Aba BDI é dispensada para os casos de Aquisição Direta de Materiais e Equipamentos. A Impressão da Aba PLQ pode ser dispensada para casos de Frente de Obra Única."]
[]
["5.3. na Aba BDI (Bonificações e Despesas Indiretas):"]
[]
["5.3.1. Escolha o tipo de empreendimento."]
["5.3.2. Escolha se o BDI será do tipo desonerado ou não (aba DADOS)"]
["5.3.3. Informe a base de cálculo do ISS (0 a 100%)."]
["5.3.4. Informe a alíquota do ISS (Normalmente de 2 a 5%)."]
["5.3.5. Defina na tabela os percentuais a serem adotados para cada item que compõe o BDI nos campos em amarelo."]
["5.3.6. Preencha o campo observações se necessário (recomendado para os orçamentos que utilizam mais de um BDI)."]
[]
["5.4. na Aba PO (Planilha Orçamentária):"]
[]
["5.4.1. Primeiramente, selecione os níveis de cada item do orçamento na coluna NÍVEL."]
["5.4.1.1: O nível de \"Serviço\" serve tanto para serviços ou insumos (mão-de-obra / material / equipamento / veículo / máquina / ferramenta / etc). Um \"nível 2/3/4\" é um título (é preenchida apenas a coluna descrição) utilizado para organizar melhor a planilha orçamentária e engloba (agrupa) serviços e agrupadores de nível inferior."]
["5.4.2. Após a seleção dos níveis, preencha, para cada serviço, as informações sobre a Fonte de Referência, (SINAPI, SICRO, SIURB, etc) e o respectivo Código de Referência."]
["5.4.3. Esta planilha é compatível com o arquivo REFERÊNCIA distribuído pela CAIXA. Caso o arquivo REFERÊNCIA esteja aberto, será possível buscar um código através do botão \"Buscar Código\". Desta forma a descrição dos serviços será preenchida automaticamente (podendo ser substituída). Caso contrário, seu preenchimento deve ser manual."]
["5.4.3.1. As descrições e unidades preenchidas automaticamente ficarão vinculadas ao arquivo REFERÊNCIA até que se use o botão \"Fixar Descrições\", que quebra a fórmula e transforma as descrições em texto."]
["5.4.4. Preencher o custo unitário do serviço/insumo na Coluna CUSTO UNITÁRIO. ATENÇÃO: o custo unitário adotado deve ser menor ou igual ao contido na tabela de referência ou mediana das cotações de mercado."]
["5.4.5. Indicar o BDI adotado para cada serviço/insumo na Coluna BDI. Preferencialmente selecione uma das opções da lista suspensa que aparecerá na célula, esta lista contém os 05 BDIs que podem ser preenchidos na Aba BDI (conforme item 5.2 das instruções). Caso seja necessária a adoção de mais de 05 valores diferentes de BDI, digite o percentual diretamente na célula."]
["5.4.6. Conforme selecionado no item 4.1. desta Aba, a Coluna Quantidade pode ser preenchida diretamente na PO, ou representar a soma das quantidades de cada Frente de Obra, informadas na aba PLQ (Planilha de Levantamento de Quantitativos)."]
["5.4.7. OBSERVAÇÃO: As demais colunas (Item / Quantidade / Preço Unitário / Preço Total) são de preenchimento automático. Não tente preenche-las ou alterá-las na Aba PO."]
["5.4.8. Se for necessário acrescentar ou excluir linhas da Planilha Orçamentária, utilize o Botão EDITAR PLANILHA e selecione as opções no quadro.\nATENÇÃO: quanto maior o número de linhas mais lento será o processamento dos dados, então acrescente apenas o número necessário ou um pouco a mais."]
["5.4.8.1. Evite deixar linhas em branco no corpo da Planilha Orçamentária."]
["5.4.9. Caso deseje importar os dados de outro arquivo utilize apenas a opção COLAR ESPECIAL ==> VALORES."]
["5.4.10. Clique no Botão LICITAR / REPROGRAMAR para preencher o Orçamento Licitado ou Reprogramado."]
[]
["5.5. na Aba PLQ (Planilha de Levantamento de Quantitativos):"]
[]
["5.5.1. Preencha primeiramente as Frentes de Obra."]
["5.5.1.1. Exemplos de Frentes de Obra (Rua A trecho 01 / Rua A trecho 02 / Rua B ; UH 01 / UH 02 / UH 03). "]
["5.5.2. Preencha as quantidades dos serviços por frente de obra. A soma das quantidades de todas as frentes de um determinado serviço será a quantidade exibida na Planilha Orçamentária."]
["5.5.3. Caso deseje incluir ou excluir frentes, utilize os botões ADICIONAR e EXCLUIR."]
[]
["5.6. na Aba CFF (Cronograma Físico-Financeiro):"]
[]
["5.6.1. Preencha a data de início da obra na aba Dados."]
["5.6.2. Preencha as porcentagens previstas por parcela para cada meta ou macrosserviço."]
["5.6.3. Para atualizar o Cronograma conforme o Orçamento e incluir ou excluir parcelas, utilize o botão EDITAR / ATUALIZAR CRONOGRAMA."]
[]
[]
[]
[]
[]
[null,null,null,null,null,null,null,null,null,null,null,"(Selecione uma Localidade)"]
[null,null,null,null,null,null,null,null,null,null,null,"Aracaju / SE",null,null,null,null,null,null,{"$f":"T38","v":0.26519999999999999}]
[null,null,null,null,null,null,null,null,null,null,null,"Belém / PA",null,null,null,null,null,null,{"$f":"U38","v":0}]
[null,null,null,null,null,null,null,null,null,null,null,"Belo Horizonte / MG",null,null,null,null,null,null,{"$f":"V38","v":0}]
[null,null,null,null,null,null,null,null,null,null,null,"Boa Vista / RR",null,null,null,null,null,null,{"$f":"W38","v":""}]
[null,null,null,null,null,null,null,null,null,null,null,"Brasília / DF",null,null,null,null,null,null,{"$f":"X38","v":""}]
[null,null,null,null,null,null,null,null,null,null,null,"Campo Grande / MS"]
[null,null,null,null,null,null,null,null,null,null,null,"Cuiabá / MT"]
[null,null,null,null,null,null,null,null,null,null,null,"Curitiba / PR",null,null,null,"Empreitada Preço Global"]
[null,null,null,null,null,null,null,null,null,null,null,"Florianópolis / SC",null,null,null,"Empreitada Preço Unitário"]
[null,null,null,null,null,null,null,null,null,null,null,"Fortaleza / CE",null,null,null,"Empreitada Integral"]
[null,null,null,null,null,null,null,null,null,null,null,"Goiânia / GO",null,null,null,"Tarefa"]
[null,null,null,null,null,null,null,null,null,null,null,"João Pessoa / PB",null,null,null,"Contratação Integrada"]
[null,null,null,null,null,null,null,null,null,null,null,"Macapá / AP",null,null,null,"Não se aplica"]
[null,null,null,null,null,null,null,null,null,null,null,"Maceió / AL"]
[null,null,null,null,null,null,null,null,null,null,null,"Manaus / AM",null,null,null,"BM"]
[null,null,null,null,null,null,null,null,null,null,null,"Natal / RN",null,null,null,"PLE"]
[null,null,null,null,null,null,null,null,null,null,null,"Palmas / TO"]
[null,null,null,null,null,null,null,null,null,null,null,"Porto Alegre / RS"]
[null,null,null,null,null,null,null,null,null,null,null,"Porto Velho / RO"]
[null,null,null,null,null,null,null,null,null,null,null,"Recife / PE"]
[null,null,null,null,null,null,null,null,null,null,null,"Rio Branco / AC"]
[null,null,null,null,null,null,null,null,null,null,null,"Rio de Janeiro / RJ"]
[null,null,null,null,null,null,null,null,null,null,null,"Salvador / BA"]
[null,null,null,null,null,null,null,null,null,null,null,"São Luís / MA"]
[null,null,null,null,null,null,null,null,null,null,null,"São Paulo / SP"]
[null,null,null,null,null,null,null,null,null,null,null,"Teresina / PI"]
[null,null,null,null,null,null,null,null,null,null,null,"Vitória / ES"]
[]
[]
[]
[]
[]
[]
[]
[]
[]
[]
[]
[]
[]
[]
[]
[]
[]
[]
[]
[]
[]
[]
[]
[]
[]
[]
[]
[]
[]
[]
[]
[]
[]
[]
[]
[]
[]
[]
[]
[]
[]
[]
[]
[]
[]
[]
[]
[]
[]
[]
[]
[]
[]
[]
[]
[]
[]
[]
[]
[]
[]
[]
[]
[]
[]
[]
[]
[]
[]
[]
[]
[]
[]
[]
[]
[]
[]
[]
[]
[]
[]
[]
[]
[]
[]
[{"$f":"A28","v":"Nº OPERAÇÃO"},null,{"$f":"C28","v":"GESTOR"},null,null,{"$f":"F28","v":"PROGRAMA"},null,null,null,{"$f":"J28","v":"AÇÃO / MODALIDADE"},null,null,null,null,null,{"$f":"P28","v":"OBJETO"}]
[{"$f":"IF(A29=\"\",\"\",A29)","v":"1.041.962-43/2017"},null,{"$f":"IF(C29=\"\",\"\",C29)","v":"MAPA"},null,null,{"$f":"IF(F29=\"\",\"\",F29)","v":"PRODESA"},null,null,null,{"$f":"IF(J29=\"\",\"\",J29)","v":"CONSTRUÇÃO DE EDIFICAÇÃO"},null,{"$f":"IF(#REF!=\"\",\"\",#REF!)","v":{"$error":"#REF!"}},null,{"$f":"IF(#REF!=\"\",\"\",#REF!)","v":{"$error":"#REF!"}},null,{"$f":"IF(P29=\"\",\"\",P29)","v":"CONSTRUÇÃO DA CASA DO PRODUTOR"}]
[]
[{"$f":"A31","v":"PROPONENTE / TOMADOR"},null,null,null,null,null,{"$f":"G31","v":"MUNICÍPIO / UF"},null,null,null,{"$f":"K31","v":"LOCALIDADE / ENDEREÇO"},null,null,null,null,null,{"$f":"Q31","v":"APELIDO DO EMPREENDIMENTO"}]
[{"$f":"IF(A32=\"\",\"\",A32)","v":"PREFEITURA MUNICIPAL DE VARGEM BONITA/SC"},null,null,null,null,null,{"$f":"IF(G32=\"\",\"\",G32)","v":"VARGEM BONITA/SC"},{"$f":"IF(I32=\"\",\"\",I32)","v":""},null,{"$f":"IF(#REF!=\"\",\"\",#REF!)","v":{"$error":"#REF!"}},{"$f":"IF(K32=\"\",\"\",K32)","v":"TRAVESSA LUIZ SALVADOR/ CENTRO"},null,null,null,null,null,{"$f":"IF(Q32=\"\",\"\",Q32)","v":"CASA DO PRODUTOR_VBO"}]
[]
[{"$f":"A37","v":"DATA BASE"},null,{"$f":"C37","v":"DESON."},{"$f":"D37","v":"LOCALIDADE DO SINAPI"},null,null,{"$f":"G37","v":"DESCRIÇÃO DO LOTE"},null,null,null,null,null,null,null,null,null,null,null,null,{"$f":"T37","v":"BDI 1"},{"$f":"U37","v":"BDI 2"},{"$f":"V37","v":"BDI 3"},{"$f":"W37","v":"BDI 4"},{"$f":"X37","v":"BDI 5"}]
[{"$f":"IF(A38=\"\",\"\",A38)","v":"2018-06-01"},null,{"$f":"IF(C38=\"\",\"\",C38)","v":"Sim"},"Florianópolis / SC","","","","","","","","","","","","","","","",0.26519999999999999,0,0,"",""]
[]
["CTEF n.º",null,"NOME DA EMPRESA / CNPJ:",null,null,null,null,"DATA BASE",null,"DESON.","REGIME DE EXECUÇÃO",null,null,"ACOMP.","OBJETO CTEF",null,null,null,null,null,"DATA ASSINATURA",null,"VIGÊNCIA"]
[{"$f":"IF(A43=\"\",\"\",A43)","v":""},null,{"$f":"IF(C43=\"\",\"\",C43)","v":""},null,{"$f":"IF(E43=\"\",\"\",E43)","v":""},null,{"$f":"IF(G43=\"\",\"\",G43)","v":""},{"$f":"IF(H43=\"\",\"\",H43)","v":""},{"$f":"IF(I43=\"\",\"\",I43)","v":""},{"$f":"IF(J43=\"\",\"\",J43)","v":""},{"$f":"IF(K43=\"\",\"\",K43)","v":""},null,{"$f":"IF(M43=\"\",\"\",M43)","v":""},{"$f":"IF(N43=\"\",\"\",N43)","v":""},{"$f":"IF(O43=\"\",\"\",O43)","v":""},null,{"$f":"IF(Q43=\"\",\"\",Q43)","v":""},null,{"$f":"IF(S43=\"\",\"\",S43)","v":""},null,{"$f":"IF(U43=\"\",\"\",U43)","v":""},null,{"$f":"IF(W43=\"\",\"\",W43)","v":""}]

{"sheet":"BDI (1)","index":1,"n_rows":59,"n_cols":23,"rows_kept":59,"cut":false,"hidden":false,"merged":[[49,9,49,11],[28,9,28,17],[25,8,25,11],[26,8,26,11],[26,15,26,17],[44,14,44,17],[30,8,30,17],[34,8,34,17],[41,14,41,17],[48,9,48,11],[39,8,39,17],[45,8,45,11],[45,14,45,17],[46,9,46,11],[46,15,46,17],[47,9,47,11],[15,19,23,20],[41,8,41,11],[17,8,17,11],[18,8,18,11],[19,8,19,11],[20,8,20,11],[21,8,21,11],[22,8,22,11],[23,8,23,11],[24,8,24,11],[15,17,16,17],[36,8,36,17],[31,15,32,15],[31,12,31,14],[32,12,32,14],[31,11,32,11],[10,8,10,15],[10,16,10,17],[3,8,3,9],[3,10,3,17],[4,8,4,9],[4,10,4,17],[6,8,6,17],[7,8,7,17],[9,8,9,15],[9,16,9,17],[47,15,47,17],[44,8,44,11],[42,8,42,11],[12,16,12,17],[13,8,13,15],[13,16,13,17],[15,12,16,12],[12,8,12,15],[15,15,16,15],[15,16,16,16],[15,13,16,13],[15,8,16,11],[15,14,16,14]]}
[null,null,null,null,"MIN","MED","MAX",null,null,null,null,null,null,{"$f":"\"Quadro de Composição do BDI \"&MID(CELL(\"nome.arquivo\",N1),5+FIND(\"BDI (\",CELL(\"nome.arquivo\",N1)),1)","v":"Quadro de Composição do BDI 1"}]
["Construção e Reforma de Edifícios","AC",{"$f":"CONCATENATE(A2,\"-\",B2)","v":"Construção e Reforma de Edifícios-AC"},null,0.03,0.04,5.5E-2]
[{"$f":"A2","v":"Construção e Reforma de Edifícios"},"SG","Construção e Reforma de Edifícios-SG",null,8.0000000000000002E-3,8.0000000000000002E-3,0.01]
[{"$f":"A3","v":"Construção e Reforma de Edifícios"},"R","Construção e Reforma de Edifícios-R",null,9.7000000000000003E-3,1.2699999999999999E-2,1.2699999999999999E-2,null,"Nº TC/CR",null,"PROPONENTE / TOMADOR"]
[{"$f":"A4","v":"Construção e Reforma de Edifícios"},"DF","Construção e Reforma de Edifícios-DF",null,5.8999999999999999E-3,1.23E-2,1.3899999999999999E-2,null,{"$f":"DADOS!A29","v":"1.041.962-43/2017"},null,{"$f":"DADOS!A32","v":"PREFEITURA MUNICIPAL DE VARGEM BONITA/SC"}]
[{"$f":"A5","v":"Construção e Reforma de Edifícios"},"L","Construção e Reforma de Edifícios-L",null,6.1600000000000002E-2,7.400000000000001E-2,8.9600000000000013E-2]
[{"$f":"A6","v":"Construção e Reforma de Edifícios"},"BDI PAD","Construção e Reforma de Edifícios-BDI PAD",null,0.2034,0.22120000000000001,0.25,null,"OBJETO"]
["Construção de Praças Urbanas, Rodovias, Ferrovias e recapeamento e pavimentação de vias urbanas","AC","Construção de Praças Urbanas, Rodovias, Ferrovias e recapeamento e pavimentação de vias urbanas-AC",null,3.7999999999999999E-2,4.0099999999999997E-2,4.6699999999999998E-2,null,{"$f":"DADOS!P29","v":"CONSTRUÇÃO DA CASA DO PRODUTOR"}]
["Construção de Praças Urbanas, Rodovias, Ferrovias e recapeamento e pavimentação de vias urbanas","SG","Construção de Praças Urbanas, Rodovias, Ferrovias e recapeamento e pavimentação de vias urbanas-SG",null,3.2000000000000002E-3,4.0000000000000001E-3,7.4000000000000003E-3]
["Construção de Praças Urbanas, Rodovias, Ferrovias e recapeamento e pavimentação de vias urbanas","R","Construção de Praças Urbanas, Rodovias, Ferrovias e recapeamento e pavimentação de vias urbanas-R",null,5.0000000000000001E-3,5.6000000000000008E-3,9.7000000000000003E-3,null,"TIPO DE OBRA DO EMPREENDIMENTO",null,null,null,null,null,null,null,"DESONERAÇÃO"]
["Construção de Praças Urbanas, Rodovias, Ferrovias e recapeamento e pavimentação de vias urbanas","DF","Construção de Praças Urbanas, Rodovias, Ferrovias e recapeamento e pavimentação de vias urbanas-DF",null,1.0200000000000001E-2,1.11E-2,1.21E-2,null,"Construção e Reforma de Edifícios",null,null,null,null,null,null,null,{"$f":"DADOS!$C$38","v":"Sim"}]
["Construção de Praças Urbanas, Rodovias, Ferrovias e recapeamento e pavimentação de vias urbanas","L","Construção de Praças Urbanas, Rodovias, Ferrovias e recapeamento e pavimentação de vias urbanas-L",null,6.6400000000000001E-2,7.2999999999999995E-2,8.6899999999999991E-2]
["Construção de Praças Urbanas, Rodovias, Ferrovias e recapeamento e pavimentação de vias urbanas","BDI PAD","Construção de Praças Urbanas, Rodovias, Ferrovias e recapeamento e pavimentação de vias urbanas-BDI PAD",null,0.19600000000000001,0.2097,0.24230000000000002,null,"Conforme legislação tributária municipal, definir estimativa de percentual da base de cálculo para o ISS:",null,null,null,null,null,null,null,1]
["Construção de Redes de Abastecimento de Água, Coleta de Esgoto","AC","Construção de Redes de Abastecimento de Água, Coleta de Esgoto-AC",null,3.4300000000000004E-2,4.9299999999999997E-2,6.7099999999999993E-2,null,"Sobre a base de cálculo, definir a respectiva alíquota do ISS (entre 2% e 5%):",null,null,null,null,null,null,null,0.03]
[{"$f":"A14","v":"Construção de Redes de Abastecimento de Água, Coleta de Esgoto"},"SG","Construção de Redes de Abastecimento de Água, Coleta de Esgoto-SG",null,2.8000000000000004E-3,4.8999999999999998E-3,7.4999999999999997E-3]
[null,null,null,null,null,null,null,null,"Itens",null,null,null,"Siglas","% Adotado","Situação","1º Quartil","Médio","3º Quartil",null,{"$f":"IF(V27,\"Para BDI fora do intervalo estatístico, deve ser apresentado Relatório Técnico Circunstanciado justificando a adoção do percentual de cada parcela do BDI.\",\"\")","v":""}]
[{"$f":"A15","v":"Construção de Redes de Abastecimento de Água, Coleta de Esgoto"},"R","Construção de Redes de Abastecimento de Água, Coleta de Esgoto-R",null,0.01,1.3899999999999999E-2,1.7399999999999999E-2]
[{"$f":"A17","v":"Construção de Redes de Abastecimento de Água, Coleta de Esgoto"},"DF","Construção de Redes de Abastecimento de Água, Coleta de Esgoto-DF",null,9.3999999999999986E-3,9.8999999999999991E-3,1.1699999999999999E-2,null,{"$f":"IF($I$11=$A$59,\"Encargos Sociais incidentes sobre a mão de obra\",\"Administração Central\")","v":"Administração Central"},null,null,null,{"$f":"IF($I$11=$A$59,\"K1\",\"AC\")","v":"AC"},3.4799999999999998E-2,"-",{"$f":"VLOOKUP(CONCATENATE(I$11,\"-\",M18),$C$2:$G$49,3,FALSE)","v":0.03},{"$f":"VLOOKUP(CONCATENATE(I$11,\"-\",M18),$C$2:$G$49,4,FALSE)","v":0.04},{"$f":"VLOOKUP(CONCATENATE(I$11,\"-\",M18),$C$2:$G$49,5,FALSE)","v":5.5E-2}]
[{"$f":"A18","v":"Construção de Redes de Abastecimento de Água, Coleta de Esgoto"},"L","Construção de Redes de Abastecimento de Água, Coleta de Esgoto-L",null,6.7400000000000002E-2,8.0399999999999985E-2,9.4E-2,null,{"$f":"IF($I$11=$A$59,\"Administração Central da empresa ou consultoria - overhead\",\"Seguro e Garantia\")","v":"Seguro e Garantia"},null,null,null,{"$f":"IF($I$11=$A$59,\"K2\",\"SG\")","v":"SG"},8.0000000000000002E-3,"-",{"$f":"VLOOKUP(CONCATENATE(I$11,\"-\",M19),$C$2:$G$49,3,FALSE)","v":8.0000000000000002E-3},{"$f":"VLOOKUP(CONCATENATE(I$11,\"-\",M19),$C$2:$G$49,4,FALSE)","v":8.0000000000000002E-3},{"$f":"VLOOKUP(CONCATENATE(I$11,\"-\",M19),$C$2:$G$49,5,FALSE)","v":0.01}]
[{"$f":"A19","v":"Construção de Redes de Abastecimento de Água, Coleta de Esgoto"},"BDI PAD","Construção de Redes de Abastecimento de Água, Coleta de Esgoto-BDI PAD",null,0.20760000000000001,0.24179999999999999,0.26440000000000002,null,{"$f":"IF($I$11=$A$59,\"\",\"Risco\")","v":"Risco"},null,null,null,{"$f":"IF($I$11=$A$59,\"\",\"R\")","v":"R"},9.7000000000000003E-3,"-",{"$f":"VLOOKUP(CONCATENATE(I$11,\"-\",M20),$C$2:$G$49,3,FALSE)","v":9.7000000000000003E-3},{"$f":"VLOOKUP(CONCATENATE(I$11,\"-\",M20),$C$2:$G$49,4,FALSE)","v":1.2699999999999999E-2},{"$f":"VLOOKUP(CONCATENATE(I$11,\"-\",M20),$C$2:$G$49,5,FALSE)","v":1.2699999999999999E-2}]
["Construção e Manutenção de Estações e Redes de Distribuição de Energia Elétrica","AC","Construção e Manutenção de Estações e Redes de Distribuição de Energia Elétrica-AC",null,5.2900000000000003E-2,5.9200000000000003E-2,7.9299999999999995E-2,null,{"$f":"IF($I$11=$A$59,\"\",\"Despesas Financeiras\")","v":"Despesas Financeiras"},null,null,null,{"$f":"IF($I$11=$A$59,\"\",\"DF\")","v":"DF"},6.0000000000000001E-3,"-",{"$f":"VLOOKUP(CONCATENATE(I$11,\"-\",M21),$C$2:$G$49,3,FALSE)","v":5.8999999999999999E-3},{"$f":"VLOOKUP(CONCATENATE(I$11,\"-\",M21),$C$2:$G$49,4,FALSE)","v":1.23E-2},{"$f":"VLOOKUP(CONCATENATE(I$11,\"-\",M21),$C$2:$G$49,5,FALSE)","v":1.3899999999999999E-2}]
[{"$f":"A21","v":"Construção e Manutenção de Estações e Redes de Distribuição de Energia Elétrica"},"SG","Construção e Manutenção de Estações e Redes de Distribuição de Energia Elétrica-SG",null,2.5000000000000001E-3,5.1000000000000004E-3,5.6000000000000008E-3,null,{"$f":"IF($I$11=$A$59,\"Margem bruta da empresa de consultoria\",\"Lucro\")","v":"Lucro"},null,null,null,{"$f":"IF($I$11=$A$59,\"K3\",\"L\")","v":"L"},6.1699999999999998E-2,"-",{"$f":"VLOOKUP(CONCATENATE(I$11,\"-\",M22),$C$2:$G$49,3,FALSE)","v":6.1600000000000002E-2},{"$f":"VLOOKUP(CONCATENATE(I$11,\"-\",M22),$C$2:$G$49,4,FALSE)","v":7.400000000000001E-2},{"$f":"VLOOKUP(CONCATENATE(I$11,\"-\",M22),$C$2:$G$49,5,FALSE)","v":8.9600000000000013E-2}]
[{"$f":"A22","v":"Construção e Manutenção de Estações e Redes de Distribuição de Energia Elétrica"},"R","Construção e Manutenção de Estações e Redes de Distribuição de Energia Elétrica-R",null,0.01,1.4800000000000001E-2,1.9699999999999999E-2,null,"Tributos (impostos COFINS 3%, e  PIS 0,65%)",null,null,null,"CP",3.6499999999999998E-2,"-",3.6499999999999998E-2,3.6499999999999998E-2,3.6499999999999998E-2]
[{"$f":"A23","v":"Construção e Manutenção de Estações e Redes de Distribuição de Energia Elétrica"},"DF","Construção e Manutenção de Estações e Redes de Distribuição de Energia Elétrica-DF",null,1.01E-2,1.0700000000000001E-2,1.11E-2,null,"Tributos (ISS, variável de acordo com o município)",null,null,null,"ISS",{"$f":"IF($I$11<>$A$58,Q14*Q13,0)","v":0.03},"-",0,2.5000000000000001E-2,0.05]
[{"$f":"A24","v":"Construção e Manutenção de Estações e Redes de Distribuição de Energia Elétrica"},"L","Construção e Manutenção de Estações e Redes de Distribuição de Energia Elétrica-L",null,0.08,8.3100000000000007E-2,9.5100000000000004E-2,null,"Tributos (Contribuição Previdenciária sobre a Receita Bruta - 0% ou 4,5% - Desoneração)",null,null,null,"CPRB",{"$f":"IF(AND($I$11<>$A$58,Q11=\"Sim\"),4.5%,0%)","v":4.4999999999999998E-2},{"$f":"IF(AND(N25>=P25, N25<=R25), \"OK\", \"Não OK\")","v":"OK"},0,4.4999999999999998E-2,4.4999999999999998E-2]
[{"$f":"A25","v":"Construção e Manutenção de Estações e Redes de Distribuição de Energia Elétrica"},"BDI PAD","Construção e Manutenção de Estações e Redes de Distribuição de Energia Elétrica-BDI PAD",null,0.24,0.25840000000000002,0.27860000000000001,null,"BDI SEM desoneração\n(Fórmula Acórdão TCU)",null,null,null,"BDI PAD",{"$f":"IF($I$11=$A$58,0,ROUND((((1+N18+N19+N20)*(1+N21)*(1+N22)/(1-(N23+N24)))-1),4))","v":0.20419999999999999},{"$f":"IF(OR($I$11=$A$59,$I$11=$A$58,AND(N26>=P26, N26<=R26)), \"OK\", \"FORA DO INTERVALO\")","v":"OK"},{"$f":"IF($I$11=$A$58,0,VLOOKUP(CONCATENATE($I$11,\"-\",$M26),$C$2:$G$49,3,FALSE))","v":0.2034},{"$f":"IF($I$11=$A$58,0,VLOOKUP(CONCATENATE($I$11,\"-\",$M26),$C$2:$G$49,4,FALSE))","v":0.22120000000000001},{"$f":"IF($I$11=$A$58,0,VLOOKUP(CONCATENATE($I$11,\"-\",$M26),$C$2:$G$49,5,FALSE))","v":0.25}]
["Obras Portuárias, Marítimas e Fluviais","AC","Obras Portuárias, Marítimas e Fluviais-AC",null,0.04,5.5199999999999999E-2,7.85E-2,null,"BDI COM desoneração",null,null,null,"BDI DES",{"$f":"IF($I$11=$A$58,0,ROUND((((1+N18+N19+N20)*(1+N21)*(1+N22)/(1-(N23+N24+N25)))-1),4))","v":0.26519999999999999},{"$f":"IF(Q11<>\"Sim\",\"\",O26)","v":"OK"},null,null,null,null,null,null,{"$f":"AND(COUNTA(N18:N23)=6,O26<>\"ok\",NOT(V29))","v":false},"pedir anexo"]
[{"$f":"A27","v":"Obras Portuárias, Marítimas e Fluviais"},"SG","Obras Portuárias, Marítimas e Fluviais-SG",null,8.1000000000000013E-3,1.2199999999999999E-2,1.9900000000000001E-2]
[{"$f":"A28","v":"Obras Portuárias, Marítimas e Fluviais"},"R","Obras Portuárias, Marítimas e Fluviais-R",null,1.46E-2,2.3199999999999998E-2,3.1600000000000003E-2,null,{"$f":"IF(V29,\"X\",\"\")","v":""},"Anexo: Relatório Técnico Circunstanciado justificando a adoção do percentual de cada parcela do BDI.",null,null,null,null,null,null,null,null,null,null,null,false,"anexo apresentado"]
[]
[null,null,null,null,null,null,null,null,"Os valores de BDI foram calculados com o emprego da fórmula:"]
[{"$f":"A29","v":"Obras Portuárias, Marítimas e Fluviais"},"DF","Obras Portuárias, Marítimas e Fluviais-DF",null,9.3999999999999986E-3,1.0200000000000001E-2,1.3300000000000001E-2,null,null,null,null,{"$f":"IF(Q11=\"Sim\",\"BDI.DES =\",\"BDI.PAD =\")","v":"BDI.DES ="},{"$f":"IF($I$11=$A$59,\"(1+K1+K2)*(1+K3)\",\"(1+AC + S + R + G)*(1 + DF)*(1+L)\")","v":"(1+AC + S + R + G)*(1 + DF)*(1+L)"},null,null," - 1"]
[{"$f":"A32","v":"Obras Portuárias, Marítimas e Fluviais"},"L","Obras Portuárias, Marítimas e Fluviais-L",null,7.1399999999999991E-2,8.4000000000000005E-2,0.1043,null,null,null,null,null,{"$f":"IF(Q11=\"Sim\",\"(1-CP-ISS-CRPB)\",\"(1-CP-ISS)\")","v":"(1-CP-ISS-CRPB)"}]
[{"$f":"A33","v":"Obras Portuárias, Marítimas e Fluviais"},"BDI PAD","Obras Portuárias, Marítimas e Fluviais-BDI PAD",null,0.22800000000000001,0.27479999999999999,0.3095]
[null,null,null,null,null,null,null,null,{"$f":"CONCATENATE(\"Declaro para os devidos fins que, conforme legislação tributária municipal, a base de cálculo para \",I11,\", é de \",Q13*100,\"%, com a respectiva alíquota de \",Q14*100,\"%.\")","v":"Declaro para os devidos fins que, conforme legislação tributária municipal, a base de cálculo para Construção e Reforma de Edifícios, é de 100%, com a respectiva alíquota de 3%."}]
[]
[null,null,null,null,null,null,null,null,{"$f":"CONCATENATE(\"Declaro para os devidos fins que o regime de Contribuição Previdenciária sobre a Receita Bruta adotado para elaboração do orçamento foi \",IF(Q11=\"Sim\",\"COM\",\"SEM\"),\" Desoneração, e que esta é a alternativa mais adequada para a Administração Pública.\")","v":"Declaro para os devidos fins que o regime de Contribuição Previdenciária sobre a Receita Bruta adotado para elaboração do orçamento foi COM Desoneração, e que esta é a alternativa mais adequada para a Administração Pública."}]
["Fornecimento de Materiais e Equipamentos (aquisição indireta - em conjunto com licitação de obras)","AC","Fornecimento de Materiais e Equipamentos (aquisição indireta - em conjunto com licitação de obras)-AC",null,1.4999999999999999E-2,3.4500000000000003E-2,4.4900000000000002E-2]
[{"$f":"A38","v":"Fornecimento de Materiais e Equipamentos (aquisição indireta - em conjunto com licitação de obras)"},"SG","Fornecimento de Materiais e Equipamentos (aquisição indireta - em conjunto com licitação de obras)-SG",null,3.0000000000000001E-3,4.7999999999999996E-3,8.199999999999999E-3,null,"Observações:"]
[{"$f":"A39","v":"Fornecimento de Materiais e Equipamentos (aquisição indireta - em conjunto com licitação de obras)"},"R","Fornecimento de Materiais e Equipamentos (aquisição indireta - em conjunto com licitação de obras)-R",null,5.6000000000000008E-3,8.5000000000000006E-3,8.8999999999999999E-3]
[{"$f":"A40","v":"Fornecimento de Materiais e Equipamentos (aquisição indireta - em conjunto com licitação de obras)"},"DF","Fornecimento de Materiais e Equipamentos (aquisição indireta - em conjunto com licitação de obras)-DF",null,8.5000000000000006E-3,8.5000000000000006E-3,1.11E-2]
[{"$f":"A41","v":"Fornecimento de Materiais e Equipamentos (aquisição indireta - em conjunto com licitação de obras)"},"L","Fornecimento de Materiais e Equipamentos (aquisição indireta - em conjunto com licitação de obras)-L",null,3.5000000000000003E-2,5.1100000000000007E-2,6.2199999999999998E-2,null,{"$f":"PO!K178","v":"VARGEM BONITA/SC"},null,null,null,null,null,{"$f":"PO!K181","v":"2019-03-18"}]
[{"$f":"A42","v":"Fornecimento de Materiais e Equipamentos (aquisição indireta - em conjunto com licitação de obras)"},"BDI PAD","Fornecimento de Materiais e Equipamentos (aquisição indireta - em conjunto com licitação de obras)-BDI PAD",null,0.111,0.14019999999999999,0.16800000000000001,null,"Local",null,null,null,null,null,"Data"]
["Estudos e Projetos, Planos e Gerenciamento e outros correlatos","K1","Estudos e Projetos, Planos e Gerenciamento e outros correlatos-K1",null,"-","-","-"]
[{"$f":"A44","v":"Estudos e Projetos, Planos e Gerenciamento e outros correlatos"},"K2","Estudos e Projetos, Planos e Gerenciamento e outros correlatos-K2",null,"-",0.2,"-"]
[{"$f":"A45","v":"Estudos e Projetos, Planos e Gerenciamento e outros correlatos"},"","Estudos e Projetos, Planos e Gerenciamento e outros correlatos-",null,"-","-","-",null,"Responsável Técnico",null,null,null,null,null,"Responsável Tomador"]
[{"$f":"A46","v":"Estudos e Projetos, Planos e Gerenciamento e outros correlatos"},"","Estudos e Projetos, Planos e Gerenciamento e outros correlatos-",null,"-","-","-",null,"Nome:",{"$f":"DADOS!B54","v":"MAX MOOSHAMMER"},null,null,null,null,"Nome:","MELÂNIA AP. ROMAN MENEGHINI"]
[{"$f":"A47","v":"Estudos e Projetos, Planos e Gerenciamento e outros correlatos"},"K3","Estudos e Projetos, Planos e Gerenciamento e outros correlatos-K3",null,"-",0.12,"-",null,"Título:",{"$f":"DADOS!B55","v":"ENGENHEIRO CIVIL"},null,null,null,null,"Cargo:","PREFEITA MUNICIPAL DE VARGEM BONITA"]
[{"$f":"A48","v":"Estudos e Projetos, Planos e Gerenciamento e outros correlatos"},"BDI PAD","Estudos e Projetos, Planos e Gerenciamento e outros correlatos-BDI PAD",null,"-","-","-",null,{"$f":"DADOS!A56","v":"CREA/CAU:"},{"$f":"DADOS!B56","v":"139.164-0"}]
[null,null,null,null,null,null,null,null,{"$f":"DADOS!A57","v":"ART/RRT:"},{"$f":"DADOS!B57","v":"6699689-7"}]
[]
["Construção e Reforma de Edifícios"]
["Construção de Praças Urbanas, Rodovias, Ferrovias e recapeamento e pavimentação de vias urbanas"]
["Construção de Redes de Abastecimento de Água, Coleta de Esgoto"]
["Construção e Manutenção de Estações e Redes de Distribuição de Energia Elétrica"]
["Obras Portuárias, Marítimas e Fluviais"]
["Fornecimento de Materiais e Equipamentos (aquisição indireta - em conjunto com licitação de obras)"]
["Fornecimento de Materiais e Equipamentos (aquisição direta)"]
["Estudos e Projetos, Planos e Gerenciamento e outros correlatos"]

{"sheet":"BDI (2)","index":2,"n_rows":59,"n_cols":23,"rows_kept":59,"cut":false,"hidden":false,"merged":[[7,8,7,17],[3,8,3,9],[3,10,3,17],[4,8,4,9],[4,10,4,17],[6,8,6,17],[9,8,9,15],[9,16,9,17],[10,8,10,15],[10,16,10,17],[12,8,12,15],[12,16,12,17],[13,8,13,15],[13,16,13,17],[15,8,16,11],[15,12,16,12],[15,13,16,13],[15,14,16,14],[15,15,16,15],[15,16,16,16],[15,17,16,17],[15,19,23,20],[17,8,17,11],[18,8,18,11],[19,8,19,11],[20,8,20,11],[21,8,21,11],[22,8,22,11],[23,8,23,11],[36,8,36,17],[24,8,24,11],[25,8,25,11],[26,8,26,11],[26,15,26,17],[28,9,28,17],[30,8,30,17],[31,11,32,11],[31,12,31,14],[31,15,32,15],[32,12,32,14],[34,8,34,17],[39,8,39,17],[41,8,41,11],[41,14,41,17],[42,8,42,11],[44,8,44,11],[44,14,44,17],[48,9,48,11],[49,9,49,11],[45,8,45,11],[45,14,45,17],[46,9,46,11],[46,15,46,17],[47,9,47,11],[47,15,47,17]]}
[null,null,null,null,"MIN","MED","MAX",null,null,null,null,null,null,{"$f":"\"Quadro de Composição do BDI \"&MID(CELL(\"nome.arquivo\",N1),5+FIND(\"BDI (\",CELL(\"nome.arquivo\",N1)),1)","v":"Quadro de Composição do BDI 2"}]
["Construção e Reforma de Edifícios","AC",{"$f":"CONCATENATE(A2,\"-\",B2)","v":"Construção e Reforma de Edifícios-AC"},null,0.03,0.04,5.5E-2]
[{"$f":"A2","v":"Construção e Reforma de Edifícios"},"SG","Construção e Reforma de Edifícios-SG",null,8.0000000000000002E-3,8.0000000000000002E-3,0.01]
[{"$f":"A3","v":"Construção e Reforma de Edifícios"},"R","Construção e Reforma de Edifícios-R",null,9.7000000000000003E-3,1.2699999999999999E-2,1.2699999999999999E-2,null,"Nº TC/CR",null,"PROPONENTE / TOMADOR"]
[{"$f":"A4","v":"Construção e Reforma de Edifícios"},"DF","Construção e Reforma de Edifícios-DF",null,5.8999999999999999E-3,1.23E-2,1.3899999999999999E-2,null,{"$f":"DADOS!A29","v":"1.041.962-43/2017"},null,{"$f":"DADOS!A32","v":"PREFEITURA MUNICIPAL DE VARGEM BONITA/SC"}]
[{"$f":"A5","v":"Construção e Reforma de Edifícios"},"L","Construção e Reforma de Edifícios-L",null,6.1600000000000002E-2,7.400000000000001E-2,8.9600000000000013E-2]
[{"$f":"A6","v":"Construção e Reforma de Edifícios"},"BDI PAD","Construção e Reforma de Edifícios-BDI PAD",null,0.2034,0.22120000000000001,0.25,null,"OBJETO"]
["Construção de Praças Urbanas, Rodovias, Ferrovias e recapeamento e pavimentação de vias urbanas","AC","Construção de Praças Urbanas, Rodovias, Ferrovias e recapeamento e pavimentação de vias urbanas-AC",null,3.7999999999999999E-2,4.0099999999999997E-2,4.6699999999999998E-2,null,{"$f":"DADOS!P29","v":"CONSTRUÇÃO DA CASA DO PRODUTOR"}]
["Construção de Praças Urbanas, Rodovias, Ferrovias e recapeamento e pavimentação de vias urbanas","SG","Construção de Praças Urbanas, Rodovias, Ferrovias e recapeamento e pavimentação de vias urbanas-SG",null,3.2000000000000002E-3,4.0000000000000001E-3,7.4000000000000003E-3]
["Construção de Praças Urbanas, Rodovias, Ferrovias e recapeamento e pavimentação de vias urbanas","R","Construção de Praças Urbanas, Rodovias, Ferrovias e recapeamento e pavimentação de vias urbanas-R",null,5.0000000000000001E-3,5.6000000000000008E-3,9.7000000000000003E-3,null,"TIPO DE OBRA DO EMPREENDIMENTO",null,null,null,null,null,null,null,"DESONERAÇÃO"]
["Construção de Praças Urbanas, Rodovias, Ferrovias e recapeamento e pavimentação de vias urbanas","DF","Construção de Praças Urbanas, Rodovias, Ferrovias e recapeamento e pavimentação de vias urbanas-DF",null,1.0200000000000001E-2,1.11E-2,1.21E-2,null,"Fornecimento de Materiais e Equipamentos (aquisição direta)",null,null,null,null,null,null,null,{"$f":"DADOS!$C$38","v":"Sim"}]
["Construção de Praças Urbanas, Rodovias, Ferrovias e recapeamento e pavimentação de vias urbanas","L","Construção de Praças Urbanas, Rodovias, Ferrovias e recapeamento e pavimentação de vias urbanas-L",null,6.6400000000000001E-2,7.2999999999999995E-2,8.6899999999999991E-2]
["Construção de Praças Urbanas, Rodovias, Ferrovias e recapeamento e pavimentação de vias urbanas","BDI PAD","Construção de Praças Urbanas, Rodovias, Ferrovias e recapeamento e pavimentação de vias urbanas-BDI PAD",null,0.19600000000000001,0.2097,0.24230000000000002,null,"Conforme legislação tributária municipal, definir estimativa de percentual da base de cálculo para o ISS:",null,null,null,null,null,null,null,1]
["Construção de Redes de Abastecimento de Água, Coleta de Esgoto","AC","Construção de Redes de Abastecimento de Água, Coleta de Esgoto-AC",null,3.4300000000000004E-2,4.9299999999999997E-2,6.7099999999999993E-2,null,"Sobre a base de cálculo, definir a respectiva alíquota do ISS (entre 2% e 5%):",null,null,null,null,null,null,null,0.03]
[{"$f":"A14","v":"Construção de Redes de Abastecimento de Água, Coleta de Esgoto"},"SG","Construção de Redes de Abastecimento de Água, Coleta de Esgoto-SG",null,2.8000000000000004E-3,4.8999999999999998E-3,7.4999999999999997E-3]
[null,null,null,null,null,null,null,null,"Itens",null,null,null,"Siglas","% Adotado","Situação","1º Quartil","Médio","3º Quartil",null,{"$f":"IF(V27,\"Para BDI fora do intervalo estatístico, deve ser apresentado Relatório Técnico Circunstanciado justificando a adoção do percentual de cada parcela do BDI.\",\"\")","v":""}]
[{"$f":"A15","v":"Construção de Redes de Abastecimento de Água, Coleta de Esgoto"},"R","Construção de Redes de Abastecimento de Água, Coleta de Esgoto-R",null,0.01,1.3899999999999999E-2,1.7399999999999999E-2]
[{"$f":"A17","v":"Construção de Redes de Abastecimento de Água, Coleta de Esgoto"},"DF","Construção de Redes de Abastecimento de Água, Coleta de Esgoto-DF",null,9.3999999999999986E-3,9.8999999999999991E-3,1.1699999999999999E-2,null,{"$f":"IF($I$11=$A$59,\"Encargos Sociais incidentes sobre a mão de obra\",\"Administração Central\")","v":"Administração Central"},null,null,null,{"$f":"IF($I$11=$A$59,\"K1\",\"AC\")","v":"AC"},0,"-",{"$f":"VLOOKUP(CONCATENATE(I$11,\"-\",M18),$C$2:$G$49,3,FALSE)","v":{"$error":"#N/A"}},{"$f":"VLOOKUP(CONCATENATE(I$11,\"-\",M18),$C$2:$G$49,4,FALSE)","v":{"$error":"#N/A"}},{"$f":"VLOOKUP(CONCATENATE(I$11,\"-\",M18),$C$2:$G$49,5,FALSE)","v":{"$error":"#N/A"}}]
[{"$f":"A18","v":"Construção de Redes de Abastecimento de Água, Coleta de Esgoto"},"L","Construção de Redes de Abastecimento de Água, Coleta de Esgoto-L",null,6.7400000000000002E-2,8.0399999999999985E-2,9.4E-2,null,{"$f":"IF($I$11=$A$59,\"Administração Central da empresa ou consultoria - overhead\",\"Seguro e Garantia\")","v":"Seguro e Garantia"},null,null,null,{"$f":"IF($I$11=$A$59,\"K2\",\"SG\")","v":"SG"},0,"-",{"$f":"VLOOKUP(CONCATENATE(I$11,\"-\",M19),$C$2:$G$49,3,FALSE)","v":{"$error":"#N/A"}},{"$f":"VLOOKUP(CONCATENATE(I$11,\"-\",M19),$C$2:$G$49,4,FALSE)","v":{"$error":"#N/A"}},{"$f":"VLOOKUP(CONCATENATE(I$11,\"-\",M19),$C$2:$G$49,5,FALSE)","v":{"$error":"#N/A"}}]
[{"$f":"A19","v":"Construção de Redes de Abastecimento de Água, Coleta de Esgoto"},"BDI PAD","Construção de Redes de Abastecimento de Água, Coleta de Esgoto-BDI PAD",null,0.20760000000000001,0.24179999999999999,0.26440000000000002,null,{"$f":"IF($I$11=$A$59,\"\",\"Risco\")","v":"Risco"},null,null,null,{"$f":"IF($I$11=$A$59,\"\",\"R\")","v":"R"},0,"-",{"$f":"VLOOKUP(CONCATENATE(I$11,\"-\",M20),$C$2:$G$49,3,FALSE)","v":{"$error":"#N/A"}},{"$f":"VLOOKUP(CONCATENATE(I$11,\"-\",M20),$C$2:$G$49,4,FALSE)","v":{"$error":"#N/A"}},{"$f":"VLOOKUP(CONCATENATE(I$11,\"-\",M20),$C$2:$G$49,5,FALSE)","v":{"$error":"#N/A"}}]
["Construção e Manutenção de Estações e Redes de Distribuição de Energia Elétrica","AC","Construção e Manutenção de Estações e Redes de Distribuição de Energia Elétrica-AC",null,5.2900000000000003E-2,5.9200000000000003E-2,7.9299999999999995E-2,null,{"$f":"IF($I$11=$A$59,\"\",\"Despesas Financeiras\")","v":"Despesas Financeiras"},null,null,null,{"$f":"IF($I$11=$A$59,\"\",\"DF\")","v":"DF"},0,"-",{"$f":"VLOOKUP(CONCATENATE(I$11,\"-\",M21),$C$2:$G$49,3,FALSE)","v":{"$error":"#N/A"}},{"$f":"VLOOKUP(CONCATENATE(I$11,\"-\",M21),$C$2:$G$49,4,FALSE)","v":{"$error":"#N/A"}},{"$f":"VLOOKUP(CONCATENATE(I$11,\"-\",M21),$C$2:$G$49,5,FALSE)","v":{"$error":"#N/A"}}]
[{"$f":"A21","v":"Construção e Manutenção de Estações e Redes de Distribuição de Energia Elétrica"},"SG","Construção e Manutenção de Estações e Redes de Distribuição de Energia Elétrica-SG",null,2.5000000000000001E-3,5.1000000000000004E-3,5.6000000000000008E-3,null,{"$f":"IF($I$11=$A$59,\"Margem bruta da empresa de consultoria\",\"Lucro\")","v":"Lucro"},null,null,null,{"$f":"IF($I$11=$A$59,\"K3\",\"L\")","v":"L"},0,"-",{"$f":"VLOOKUP(CONCATENATE(I$11,\"-\",M22),$C$2:$G$49,3,FALSE)","v":{"$error":"#N/A"}},{"$f":"VLOOKUP(CONCATENATE(I$11,\"-\",M22),$C$2:$G$49,4,FALSE)","v":{"$error":"#N/A"}},{"$f":"VLOOKUP(CONCATENATE(I$11,\"-\",M22),$C$2:$G$49,5,FALSE)","v":{"$error":"#N/A"}}]
[{"$f":"A22","v":"Construção e Manutenção de Estações e Redes de Distribuição de Energia Elétrica"},"R","Construção e Manutenção de Estações e Redes de Distribuição de Energia Elétrica-R",null,0.01,1.4800000000000001E-2,1.9699999999999999E-2,null,"Tributos (impostos COFINS 3%, e  PIS 0,65%)",null,null,null,"CP",0,"-",3.6499999999999998E-2,3.6499999999999998E-2,3.6499999999999998E-2]
[{"$f":"A23","v":"Construção e Manutenção de Estações e Redes de Distribuição de Energia Elétrica"},"DF","Construção e Manutenção de Estações e Redes de Distribuição de Energia Elétrica-DF",null,1.01E-2,1.0700000000000001E-2,1.11E-2,null,"Tributos (ISS, variável de acordo com o município)",null,null,null,"ISS",{"$f":"IF($I$11<>$A$58,Q14*Q13,0)","v":0},"-",0,2.5000000000000001E-2,0.05]
[{"$f":"A24","v":"Construção e Manutenção de Estações e Redes de Distribuição de Energia Elétrica"},"L","Construção e Manutenção de Estações e Redes de Distribuição de Energia Elétrica-L",null,0.08,8.3100000000000007E-2,9.5100000000000004E-2,null,"Tributos (Contribuição Previdenciária sobre a Receita Bruta - 0% ou 4,5% - Desoneração)",null,null,null,"CPRB",{"$f":"IF(AND($I$11<>$A$58,Q11=\"Sim\"),4.5%,0%)","v":0},{"$f":"IF(AND(N25>=P25, N25<=R25), \"OK\", \"Não OK\")","v":"OK"},0,4.4999999999999998E-2,4.4999999999999998E-2]
[{"$f":"A25","v":"Construção e Manutenção de Estações e Redes de Distribuição de Energia Elétrica"},"BDI PAD","Construção e Manutenção de Estações e Redes de Distribuição de Energia Elétrica-BDI PAD",null,0.24,0.25840000000000002,0.27860000000000001,null,"BDI SEM desoneração\n(Fórmula Acórdão TCU)",null,null,null,"BDI PAD",{"$f":"IF($I$11=$A$58,0,ROUND((((1+N18+N19+N20)*(1+N21)*(1+N22)/(1-(N23+N24)))-1),4))","v":0},{"$f":"IF(OR($I$11=$A$59,$I$11=$A$58,AND(N26>=P26, N26<=R26)), \"OK\", \"FORA DO INTERVALO\")","v":"OK"},{"$f":"IF($I$11=$A$58,0,VLOOKUP(CONCATENATE($I$11,\"-\",$M26),$C$2:$G$49,3,FALSE))","v":0},{"$f":"IF($I$11=$A$58,0,VLOOKUP(CONCATENATE($I$11,\"-\",$M26),$C$2:$G$49,4,FALSE))","v":0},{"$f":"IF($I$11=$A$58,0,VLOOKUP(CONCATENATE($I$11,\"-\",$M26),$C$2:$G$49,5,FALSE))","v":0}]
["Obras Portuárias, Marítimas e Fluviais","AC","Obras Portuárias, Marítimas e Fluviais-AC",null,0.04,5.5199999999999999E-2,7.85E-2,null,"BDI COM desoneração",null,null,null,"BDI DES",{"$f":"IF($I$11=$A$58,0,ROUND((((1+N18+N19+N20)*(1+N21)*(1+N22)/(1-(N23+N24+N25)))-1),4))","v":0},{"$f":"IF(Q11<>\"Sim\",\"\",O26)","v":"OK"},null,null,null,null,null,null,{"$f":"AND(COUNTA(N18:N23)=6,O26<>\"ok\",NOT(V29))","v":false},"pedir anexo"]
[{"$f":"A27","v":"Obras Portuárias, Marítimas e Fluviais"},"SG","Obras Portuárias, Marítimas e Fluviais-SG",null,8.1000000000000013E-3,1.2199999999999999E-2,1.9900000000000001E-2]
[{"$f":"A28","v":"Obras Portuárias, Marítimas e Fluviais"},"R","Obras Portuárias, Marítimas e Fluviais-R",null,1.46E-2,2.3199999999999998E-2,3.1600000000000003E-2,null,{"$f":"IF(V29,\"X\",\"\")","v":""},"Anexo: Relatório Técnico Circunstanciado justificando a adoção do percentual de cada parcela do BDI.",null,null,null,null,null,null,null,null,null,null,null,false,"anexo apresentado"]
[]
[null,null,null,null,null,null,null,null,"Os valores de BDI foram calculados com o emprego da fórmula:"]
[{"$f":"A29","v":"Obras Portuárias, Marítimas e Fluviais"},"DF","Obras Portuárias, Marítimas e Fluviais-DF",null,9.3999999999999986E-3,1.0200000000000001E-2,1.3300000000000001E-2,null,null,null,null,{"$f":"IF(Q11=\"Sim\",\"BDI.DES =\",\"BDI.PAD =\")","v":"BDI.DES ="},{"$f":"IF($I$11=$A$59,\"(1+K1+K2)*(1+K3)\",\"(1+AC + S + R + G)*(1 + DF)*(1+L)\")","v":"(1+AC + S + R + G)*(1 + DF)*(1+L)"},null,null," - 1"]
[{"$f":"A32","v":"Obras Portuárias, Marítimas e Fluviais"},"L","Obras Portuárias, Marítimas e Fluviais-L",null,7.1399999999999991E-2,8.4000000000000005E-2,0.1043,null,null,null,null,null,{"$f":"IF(Q11=\"Sim\",\"(1-CP-ISS-CRPB)\",\"(1-CP-ISS)\")","v":"(1-CP-ISS-CRPB)"}]
[{"$f":"A33","v":"Obras Portuárias, Marítimas e Fluviais"},"BDI PAD","Obras Portuárias, Marítimas e Fluviais-BDI PAD",null,0.22800000000000001,0.27479999999999999,0.3095]
[null,null,null,null,null,null,null,null,{"$f":"CONCATENATE(\"Declaro para os devidos fins que, conforme legislação tributária municipal, a base de cálculo para \",I11,\", é de \",Q13*100,\"%, com a respectiva alíquota de \",Q14*100,\"%.\")","v":"Declaro para os devidos fins que, conforme legislação tributária municipal, a base de cálculo para Fornecimento de Materiais e Equipamentos (aquisição direta), é de 100%, com a respectiva alíquota de 3%."}]
[]
[null,null,null,null,null,null,null,null,{"$f":"CONCATENATE(\"Declaro para os devidos fins que o regime de Contribuição Previdenciária sobre a Receita Bruta adotado para elaboração do orçamento foi \",IF(Q11=\"Sim\",\"COM\",\"SEM\"),\" Desoneração, e que esta é a alternativa mais adequada para a Administração Pública.\")","v":"Declaro para os devidos fins que o regime de Contribuição Previdenciária sobre a Receita Bruta adotado para elaboração do orçamento foi COM Desoneração, e que esta é a alternativa mais adequada para a Administração Pública."}]
["Fornecimento de Materiais e Equipamentos (aquisição indireta - em conjunto com licitação de obras)","AC","Fornecimento de Materiais e Equipamentos (aquisição indireta - em conjunto com licitação de obras)-AC",null,1.4999999999999999E-2,3.4500000000000003E-2,4.4900000000000002E-2]
[{"$f":"A38","v":"Fornecimento de Materiais e Equipamentos (aquisição indireta - em conjunto com licitação de obras)"},"SG","Fornecimento de Materiais e Equipamentos (aquisição indireta - em conjunto com licitação de obras)-SG",null,3.0000000000000001E-3,4.7999999999999996E-3,8.199999999999999E-3,null,"Observações:"]
[{"$f":"A39","v":"Fornecimento de Materiais e Equipamentos (aquisição indireta - em conjunto com licitação de obras)"},"R","Fornecimento de Materiais e Equipamentos (aquisição indireta - em conjunto com licitação de obras)-R",null,5.6000000000000008E-3,8.5000000000000006E-3,8.8999999999999999E-3,null,"Bdi apresentado com valor nulo em decorrência de que as cotações de mercado já apresentação o valor final"]
[{"$f":"A40","v":"Fornecimento de Materiais e Equipamentos (aquisição indireta - em conjunto com licitação de obras)"},"DF","Fornecimento de Materiais e Equipamentos (aquisição indireta - em conjunto com licitação de obras)-DF",null,8.5000000000000006E-3,8.5000000000000006E-3,1.11E-2]
[{"$f":"A41","v":"Fornecimento de Materiais e Equipamentos (aquisição indireta - em conjunto com licitação de obras)"},"L","Fornecimento de Materiais e Equipamentos (aquisição indireta - em conjunto com licitação de obras)-L",null,3.5000000000000003E-2,5.1100000000000007E-2,6.2199999999999998E-2,null,{"$f":"PO!K178","v":"VARGEM BONITA/SC"},null,null,null,null,null,{"$f":"PO!K181","v":"2019-03-18"}]
[{"$f":"A42","v":"Fornecimento de Materiais e Equipamentos (aquisição indireta - em conjunto com licitação de obras)"},"BDI PAD","Fornecimento de Materiais e Equipamentos (aquisição indireta - em conjunto com licitação de obras)-BDI PAD",null,0.111,0.14019999999999999,0.16800000000000001,null,"Local",null,null,null,null,null,"Data"]
["Estudos e Projetos, Planos e Gerenciamento e outros correlatos","K1","Estudos e Projetos, Planos e Gerenciamento e outros correlatos-K1",null,"-","-","-"]
[{"$f":"A44","v":"Estudos e Projetos, Planos e Gerenciamento e outros correlatos"},"K2","Estudos e Projetos, Planos e Gerenciamento e outros correlatos-K2",null,"-",0.2,"-"]
[{"$f":"A45","v":"Estudos e Projetos, Planos e Gerenciamento e outros correlatos"},"","Estudos e Projetos, Planos e Gerenciamento e outros correlatos-",null,"-","-","-",null,"Responsável Técnico",null,null,null,null,null,"Responsável Tomador"]
[{"$f":"A46","v":"Estudos e Projetos, Planos e Gerenciamento e outros correlatos"},"","Estudos e Projetos, Planos e Gerenciamento e outros correlatos-",null,"-","-","-",null,"Nome:",{"$f":"DADOS!B54","v":"MAX MOOSHAMMER"},null,null,null,null,"Nome:","MELÂNIA AP. ROMAN MENEGHINI"]
[{"$f":"A47","v":"Estudos e Projetos, Planos e Gerenciamento e outros correlatos"},"K3","Estudos e Projetos, Planos e Gerenciamento e outros correlatos-K3",null,"-",0.12,"-",null,"Título:",{"$f":"DADOS!B55","v":"ENGENHEIRO CIVIL"},null,null,null,null,"Cargo:","PREFEITA MUNICIPAL DE VARGEM BONITA"]
[{"$f":"A48","v":"Estudos e Projetos, Planos e Gerenciamento e outros correlatos"},"BDI PAD","Estudos e Projetos, Planos e Gerenciamento e outros correlatos-BDI PAD",null,"-","-","-",null,{"$f":"DADOS!A56","v":"CREA/CAU:"},{"$f":"DADOS!B56","v":"139.164-0"}]
[null,null,null,null,null,null,null,null,{"$f":"DADOS!A57","v":"ART/RRT:"},{"$f":"DADOS!B57","v":"6699689-7"}]
[]
["Construção e Reforma de Edifícios"]
["Construção de Praças Urbanas, Rodovias, Ferrovias e recapeamento e pavimentação de vias urbanas"]
["Construção de Redes de Abastecimento de Água, Coleta de Esgoto"]
["Construção e Manutenção de Estações e Redes de Distribuição de Energia Elétrica"]
["Obras Portuárias, Marítimas e Fluviais"]
["Fornecimento de Materiais e Equipamentos (aquisição indireta - em conjunto com licitação de obras)"]
["Fornecimento de Materiais e Equipamentos (aquisição direta)"]
["Estudos e Projetos, Planos e Gerenciamento e outros correlatos"]

{"sheet":"BDI (3)","index":3,"n_rows":59,"n_cols":23,"rows_kept":59,"cut":false,"hidden":false,"merged":[[48,9,48,11],[49,9,49,11],[45,8,45,11],[45,14,45,17],[46,9,46,11],[46,15,46,17],[47,9,47,11],[47,15,47,17],[39,8,39,17],[41,8,41,11],[41,14,41,17],[42,8,42,11],[44,8,44,11],[44,14,44,17],[36,8,36,17],[24,8,24,11],[25,8,25,11],[26,8,26,11],[26,15,26,17],[28,9,28,17],[30,8,30,17],[31,11,32,11],[31,12,31,14],[31,15,32,15],[32,12,32,14],[34,8,34,17],[15,19,23,20],[17,8,17,11],[18,8,18,11],[19,8,19,11],[20,8,20,11],[21,8,21,11],[22,8,22,11],[23,8,23,11],[13,8,13,15],[13,16,13,17],[15,8,16,11],[15,12,16,12],[15,13,16,13],[15,14,16,14],[15,15,16,15],[15,16,16,16],[15,17,16,17],[9,8,9,15],[9,16,9,17],[10,8,10,15],[10,16,10,17],[12,8,12,15],[12,16,12,17],[7,8,7,17],[3,8,3,9],[3,10,3,17],[4,8,4,9],[4,10,4,17],[6,8,6,17]]}
[null,null,null,null,"MIN","MED","MAX",null,null,null,null,null,null,{"$f":"\"Quadro de Composição do BDI \"&MID(CELL(\"nome.arquivo\",N1),5+FIND(\"BDI (\",CELL(\"nome.arquivo\",N1)),1)","v":"Quadro de Composição do BDI 3"}]
["Construção e Reforma de Edifícios","AC",{"$f":"CONCATENATE(A2,\"-\",B2)","v":"Construção e Reforma de Edifícios-AC"},null,0.03,0.04,5.5E-2]
[{"$f":"A2","v":"Construção e Reforma de Edifícios"},"SG","Construção e Reforma de Edifícios-SG",null,8.0000000000000002E-3,8.0000000000000002E-3,0.01]
[{"$f":"A3","v":"Construção e Reforma de Edifícios"},"R","Construção e Reforma de Edifícios-R",null,9.7000000000000003E-3,1.2699999999999999E-2,1.2699999999999999E-2,null,"Nº TC/CR",null,"PROPONENTE / TOMADOR"]
[{"$f":"A4","v":"Construção e Reforma de Edifícios"},"DF","Construção e Reforma de Edifícios-DF",null,5.8999999999999999E-3,1.23E-2,1.3899999999999999E-2,null,{"$f":"DADOS!A29","v":"1.041.962-43/2017"},null,{"$f":"DADOS!A32","v":"PREFEITURA MUNICIPAL DE VARGEM BONITA/SC"}]
[{"$f":"A5","v":"Construção e Reforma de Edifícios"},"L","Construção e Reforma de Edifícios-L",null,6.1600000000000002E-2,7.400000000000001E-2,8.9600000000000013E-2]
[{"$f":"A6","v":"Construção e Reforma de Edifícios"},"BDI PAD","Construção e Reforma de Edifícios-BDI PAD",null,0.2034,0.22120000000000001,0.25,null,"OBJETO"]
["Construção de Praças Urbanas, Rodovias, Ferrovias e recapeamento e pavimentação de vias urbanas","AC","Construção de Praças Urbanas, Rodovias, Ferrovias e recapeamento e pavimentação de vias urbanas-AC",null,3.7999999999999999E-2,4.0099999999999997E-2,4.6699999999999998E-2,null,{"$f":"DADOS!P29","v":"CONSTRUÇÃO DA CASA DO PRODUTOR"}]
["Construção de Praças Urbanas, Rodovias, Ferrovias e recapeamento e pavimentação de vias urbanas","SG","Construção de Praças Urbanas, Rodovias, Ferrovias e recapeamento e pavimentação de vias urbanas-SG",null,3.2000000000000002E-3,4.0000000000000001E-3,7.4000000000000003E-3]
["Construção de Praças Urbanas, Rodovias, Ferrovias e recapeamento e pavimentação de vias urbanas","R","Construção de Praças Urbanas, Rodovias, Ferrovias e recapeamento e pavimentação de vias urbanas-R",null,5.0000000000000001E-3,5.6000000000000008E-3,9.7000000000000003E-3,null,"TIPO DE OBRA DO EMPREENDIMENTO",null,null,null,null,null,null,null,"DESONERAÇÃO"]
["Construção de Praças Urbanas, Rodovias, Ferrovias e recapeamento e pavimentação de vias urbanas","DF","Construção de Praças Urbanas, Rodovias, Ferrovias e recapeamento e pavimentação de vias urbanas-DF",null,1.0200000000000001E-2,1.11E-2,1.21E-2,null,"Fornecimento de Materiais e Equipamentos (aquisição direta)",null,null,null,null,null,null,null,{"$f":"DADOS!$C$38","v":"Sim"}]
["Construção de Praças Urbanas, Rodovias, Ferrovias e recapeamento e pavimentação de vias urbanas","L","Construção de Praças Urbanas, Rodovias, Ferrovias e recapeamento e pavimentação de vias urbanas-L",null,6.6400000000000001E-2,7.2999999999999995E-2,8.6899999999999991E-2]
["Construção de Praças Urbanas, Rodovias, Ferrovias e recapeamento e pavimentação de vias urbanas","BDI PAD","Construção de Praças Urbanas, Rodovias, Ferrovias e recapeamento e pavimentação de vias urbanas-BDI PAD",null,0.19600000000000001,0.2097,0.24230000000000002,null,"Conforme legislação tributária municipal, definir estimativa de percentual da base de cálculo para o ISS:",null,null,null,null,null,null,null,1]
["Construção de Redes de Abastecimento de Água, Coleta de Esgoto","AC","Construção de Redes de Abastecimento de Água, Coleta de Esgoto-AC",null,3.4300000000000004E-2,4.9299999999999997E-2,6.7099999999999993E-2,null,"Sobre a base de cálculo, definir a respectiva alíquota do ISS (entre 2% e 5%):",null,null,null,null,null,null,null,0.03]
[{"$f":"A14","v":"Construção de Redes de Abastecimento de Água, Coleta de Esgoto"},"SG","Construção de Redes de Abastecimento de Água, Coleta de Esgoto-SG",null,2.8000000000000004E-3,4.8999999999999998E-3,7.4999999999999997E-3]
[null,null,null,null,null,null,null,null,"Itens",null,null,null,"Siglas","% Adotado","Situação","1º Quartil","Médio","3º Quartil",null,{"$f":"IF(V27,\"Para BDI fora do intervalo estatístico, deve ser apresentado Relatório Técnico Circunstanciado justificando a adoção do percentual de cada parcela do BDI.\",\"\")","v":""}]
[{"$f":"A15","v":"Construção de Redes de Abastecimento de Água, Coleta de Esgoto"},"R","Construção de Redes de Abastecimento de Água, Coleta de Esgoto-R",null,0.01,1.3899999999999999E-2,1.7399999999999999E-2]
[{"$f":"A17","v":"Construção de Redes de Abastecimento de Água, Coleta de Esgoto"},"DF","Construção de Redes de Abastecimento de Água, Coleta de Esgoto-DF",null,9.3999999999999986E-3,9.8999999999999991E-3,1.1699999999999999E-2,null,{"$f":"IF($I$11=$A$59,\"Encargos Sociais incidentes sobre a mão de obra\",\"Administração Central\")","v":"Administração Central"},null,null,null,{"$f":"IF($I$11=$A$59,\"K1\",\"AC\")","v":"AC"},0,"-",{"$f":"VLOOKUP(CONCATENATE(I$11,\"-\",M18),$C$2:$G$49,3,FALSE)","v":{"$error":"#N/A"}},{"$f":"VLOOKUP(CONCATENATE(I$11,\"-\",M18),$C$2:$G$49,4,FALSE)","v":{"$error":"#N/A"}},{"$f":"VLOOKUP(CONCATENATE(I$11,\"-\",M18),$C$2:$G$49,5,FALSE)","v":{"$error":"#N/A"}}]
[{"$f":"A18","v":"Construção de Redes de Abastecimento de Água, Coleta de Esgoto"},"L","Construção de Redes de Abastecimento de Água, Coleta de Esgoto-L",null,6.7400000000000002E-2,8.0399999999999985E-2,9.4E-2,null,{"$f":"IF($I$11=$A$59,\"Administração Central da empresa ou consultoria - overhead\",\"Seguro e Garantia\")","v":"Seguro e Garantia"},null,null,null,{"$f":"IF($I$11=$A$59,\"K2\",\"SG\")","v":"SG"},0,"-",{"$f":"VLOOKUP(CONCATENATE(I$11,\"-\",M19),$C$2:$G$49,3,FALSE)","v":{"$error":"#N/A"}},{"$f":"VLOOKUP(CONCATENATE(I$11,\"-\",M19),$C$2:$G$49,4,FALSE)","v":{"$error":"#N/A"}},{"$f":"VLOOKUP(CONCATENATE(I$11,\"-\",M19),$C$2:$G$49,5,FALSE)","v":{"$error":"#N/A"}}]
[{"$f":"A19","v":"Construção de Redes de Abastecimento de Água, Coleta de Esgoto"},"BDI PAD","Construção de Redes de Abastecimento de Água, Coleta de Esgoto-BDI PAD",null,0.20760000000000001,0.24179999999999999,0.26440000000000002,null,{"$f":"IF($I$11=$A$59,\"\",\"Risco\")","v":"Risco"},null,null,null,{"$f":"IF($I$11=$A$59,\"\",\"R\")","v":"R"},0,"-",{"$f":"VLOOKUP(CONCATENATE(I$11,\"-\",M20),$C$2:$G$49,3,FALSE)","v":{"$error":"#N/A"}},{"$f":"VLOOKUP(CONCATENATE(I$11,\"-\",M20),$C$2:$G$49,4,FALSE)","v":{"$error":"#N/A"}},{"$f":"VLOOKUP(CONCATENATE(I$11,\"-\",M20),$C$2:$G$49,5,FALSE)","v":{"$error":"#N/A"}}]
["Construção e Manutenção de Estações e Redes de Distribuição de Energia Elétrica","AC","Construção e Manutenção de Estações e Redes de Distribuição de Energia Elétrica-AC",null,5.2900000000000003E-2,5.9200000000000003E-2,7.9299999999999995E-2,null,{"$f":"IF($I$11=$A$59,\"\",\"Despesas Financeiras\")","v":"Despesas Financeiras"},null,null,null,{"$f":"IF($I$11=$A$59,\"\",\"DF\")","v":"DF"},0,"-",{"$f":"VLOOKUP(CONCATENATE(I$11,\"-\",M21),$C$2:$G$49,3,FALSE)","v":{"$error":"#N/A"}},{"$f":"VLOOKUP(CONCATENATE(I$11,\"-\",M21),$C$2:$G$49,4,FALSE)","v":{"$error":"#N/A"}},{"$f":"VLOOKUP(CONCATENATE(I$11,\"-\",M21),$C$2:$G$49,5,FALSE)","v":{"$error":"#N/A"}}]
[{"$f":"A21","v":"Construção e Manutenção de Estações e Redes de Distribuição de Energia Elétrica"},"SG","Construção e Manutenção de Estações e Redes de Distribuição de Energia Elétrica-SG",null,2.5000000000000001E-3,5.1000000000000004E-3,5.6000000000000008E-3,null,{"$f":"IF($I$11=$A$59,\"Margem bruta da empresa de consultoria\",\"Lucro\")","v":"Lucro"},null,null,null,{"$f":"IF($I$11=$A$59,\"K3\",\"L\")","v":"L"},0,"-",{"$f":"VLOOKUP(CONCATENATE(I$11,\"-\",M22),$C$2:$G$49,3,FALSE)","v":{"$error":"#N/A"}},{"$f":"VLOOKUP(CONCATENATE(I$11,\"-\",M22),$C$2:$G$49,4,FALSE)","v":{"$error":"#N/A"}},{"$f":"VLOOKUP(CONCATENATE(I$11,\"-\",M22),$C$2:$G$49,5,FALSE)","v":{"$error":"#N/A"}}]
[{"$f":"A22","v":"Construção e Manutenção de Estações e Redes de Distribuição de Energia Elétrica"},"R","Construção e Manutenção de Estações e Redes de Distribuição de Energia Elétrica-R",null,0.01,1.4800000000000001E-2,1.9699999999999999E-2,null,"Tributos (impostos COFINS 3%, e  PIS 0,65%)",null,null,null,"CP",0,"-",3.6499999999999998E-2,3.6499999999999998E-2,3.6499999999999998E-2]
[{"$f":"A23","v":"Construção e Manutenção de Estações e Redes de Distribuição de Energia Elétrica"},"DF","Construção e Manutenção de Estações e Redes de Distribuição de Energia Elétrica-DF",null,1.01E-2,1.0700000000000001E-2,1.11E-2,null,"Tributos (ISS, variável de acordo com o município)",null,null,null,"ISS",{"$f":"IF($I$11<>$A$58,Q14*Q13,0)","v":0},"-",0,2.5000000000000001E-2,0.05]
[{"$f":"A24","v":"Construção e Manutenção de Estações e Redes de Distribuição de Energia Elétrica"},"L","Construção e Manutenção de Estações e Redes de Distribuição de Energia Elétrica-L",null,0.08,8.3100000000000007E-2,9.5100000000000004E-2,null,"Tributos (Contribuição Previdenciária sobre a Receita Bruta - 0% ou 4,5% - Desoneração)",null,null,null,"CPRB",{"$f":"IF(AND($I$11<>$A$58,Q11=\"Sim\"),4.5%,0%)","v":0},{"$f":"IF(AND(N25>=P25, N25<=R25), \"OK\", \"Não OK\")","v":"OK"},0,4.4999999999999998E-2,4.4999999999999998E-2]
[{"$f":"A25","v":"Construção e Manutenção de Estações e Redes de Distribuição de Energia Elétrica"},"BDI PAD","Construção e Manutenção de Estações e Redes de Distribuição de Energia Elétrica-BDI PAD",null,0.24,0.25840000000000002,0.27860000000000001,null,"BDI SEM desoneração\n(Fórmula Acórdão TCU)",null,null,null,"BDI PAD",{"$f":"IF($I$11=$A$58,0,ROUND((((1+N18+N19+N20)*(1+N21)*(1+N22)/(1-(N23+N24)))-1),4))","v":0},{"$f":"IF(OR($I$11=$A$59,$I$11=$A$58,AND(N26>=P26, N26<=R26)), \"OK\", \"FORA DO INTERVALO\")","v":"OK"},{"$f":"IF($I$11=$A$58,0,VLOOKUP(CONCATENATE($I$11,\"-\",$M26),$C$2:$G$49,3,FALSE))","v":0},{"$f":"IF($I$11=$A$58,0,VLOOKUP(CONCATENATE($I$11,\"-\",$M26),$C$2:$G$49,4,FALSE))","v":0},{"$f":"IF($I$11=$A$58,0,VLOOKUP(CONCATENATE($I$11,\"-\",$M26),$C$2:$G$49,5,FALSE))","v":0}]
["Obras Portuárias, Marítimas e Fluviais","AC","Obras Portuárias, Marítimas e Fluviais-AC",null,0.04,5.5199999999999999E-2,7.85E-2,null,"BDI COM desoneração",null,null,null,"BDI DES",{"$f":"IF($I$11=$A$58,0,ROUND((((1+N18+N19+N20)*(1+N21)*(1+N22)/(1-(N23+N24+N25)))-1),4))","v":0},{"$f":"IF(Q11<>\"Sim\",\"\",O26)","v":"OK"},null,null,null,null,null,null,{"$f":"AND(COUNTA(N18:N23)=6,O26<>\"ok\",NOT(V29))","v":false},"pedir anexo"]
[{"$f":"A27","v":"Obras Portuárias, Marítimas e Fluviais"},"SG","Obras Portuárias, Marítimas e Fluviais-SG",null,8.1000000000000013E-3,1.2199999999999999E-2,1.9900000000000001E-2]
[{"$f":"A28","v":"Obras Portuárias, Marítimas e Fluviais"},"R","Obras Portuárias, Marítimas e Fluviais-R",null,1.46E-2,2.3199999999999998E-2,3.1600000000000003E-2,null,{"$f":"IF(V29,\"X\",\"\")","v":""},"Anexo: Relatório Técnico Circunstanciado justificando a adoção do percentual de cada parcela do BDI.",null,null,null,null,null,null,null,null,null,null,null,false,"anexo apresentado"]
[]
[null,null,null,null,null,null,null,null,"Os valores de BDI foram calculados com o emprego da fórmula:"]
[{"$f":"A29","v":"Obras Portuárias, Marítimas e Fluviais"},"DF","Obras Portuárias, Marítimas e Fluviais-DF",null,9.3999999999999986E-3,1.0200000000000001E-2,1.3300000000000001E-2,null,null,null,null,{"$f":"IF(Q11=\"Sim\",\"BDI.DES =\",\"BDI.PAD =\")","v":"BDI.DES ="},{"$f":"IF($I$11=$A$59,\"(1+K1+K2)*(1+K3)\",\"(1+AC + S + R + G)*(1 + DF)*(1+L)\")","v":"(1+AC + S + R + G)*(1 + DF)*(1+L)"},null,null," - 1"]
[{"$f":"A32","v":"Obras Portuárias, Marítimas e Fluviais"},"L","Obras Portuárias, Marítimas e Fluviais-L",null,7.1399999999999991E-2,8.4000000000000005E-2,0.1043,null,null,null,null,null,{"$f":"IF(Q11=\"Sim\",\"(1-CP-ISS-CRPB)\",\"(1-CP-ISS)\")","v":"(1-CP-ISS-CRPB)"}]
[{"$f":"A33","v":"Obras Portuárias, Marítimas e Fluviais"},"BDI PAD","Obras Portuárias, Marítimas e Fluviais-BDI PAD",null,0.22800000000000001,0.27479999999999999,0.3095]
[null,null,null,null,null,null,null,null,{"$f":"CONCATENATE(\"Declaro para os devidos fins que, conforme legislação tributária municipal, a base de cálculo para \",I11,\", é de \",Q13*100,\"%, com a respectiva alíquota de \",Q14*100,\"%.\")","v":"Declaro para os devidos fins que, conforme legislação tributária municipal, a base de cálculo para Fornecimento de Materiais e Equipamentos (aquisição direta), é de 100%, com a respectiva alíquota de 3%."}]
[]
[null,null,null,null,null,null,null,null,{"$f":"CONCATENATE(\"Declaro para os devidos fins que o regime de Contribuição Previdenciária sobre a Receita Bruta adotado para elaboração do orçamento foi \",IF(Q11=\"Sim\",\"COM\",\"SEM\"),\" Desoneração, e que esta é a alternativa mais adequada para a Administração Pública.\")","v":"Declaro para os devidos fins que o regime de Contribuição Previdenciária sobre a Receita Bruta adotado para elaboração do orçamento foi COM Desoneração, e que esta é a alternativa mais adequada para a Administração Pública."}]
["Fornecimento de Materiais e Equipamentos (aquisição indireta - em conjunto com licitação de obras)","AC","Fornecimento de Materiais e Equipamentos (aquisição indireta - em conjunto com licitação de obras)-AC",null,1.4999999999999999E-2,3.4500000000000003E-2,4.4900000000000002E-2]
[{"$f":"A38","v":"Fornecimento de Materiais e Equipamentos (aquisição indireta - em conjunto com licitação de obras)"},"SG","Fornecimento de Materiais e Equipamentos (aquisição indireta - em conjunto com licitação de obras)-SG",null,3.0000000000000001E-3,4.7999999999999996E-3,8.199999999999999E-3,null,"Observações:"]
[{"$f":"A39","v":"Fornecimento de Materiais e Equipamentos (aquisição indireta - em conjunto com licitação de obras)"},"R","Fornecimento de Materiais e Equipamentos (aquisição indireta - em conjunto com licitação de obras)-R",null,5.6000000000000008E-3,8.5000000000000006E-3,8.8999999999999999E-3]
[{"$f":"A40","v":"Fornecimento de Materiais e Equipamentos (aquisição indireta - em conjunto com licitação de obras)"},"DF","Fornecimento de Materiais e Equipamentos (aquisição indireta - em conjunto com licitação de obras)-DF",null,8.5000000000000006E-3,8.5000000000000006E-3,1.11E-2]
[{"$f":"A41","v":"Fornecimento de Materiais e Equipamentos (aquisição indireta - em conjunto com licitação de obras)"},"L","Fornecimento de Materiais e Equipamentos (aquisição indireta - em conjunto com licitação de obras)-L",null,3.5000000000000003E-2,5.1100000000000007E-2,6.2199999999999998E-2,null,{"$f":"PO!K178","v":"VARGEM BONITA/SC"},null,null,null,null,null,{"$f":"PO!K181","v":"2019-03-18"}]
[{"$f":"A42","v":"Fornecimento de Materiais e Equipamentos (aquisição indireta - em conjunto com licitação de obras)"},"BDI PAD","Fornecimento de Materiais e Equipamentos (aquisição indireta - em conjunto com licitação de obras)-BDI PAD",null,0.111,0.14019999999999999,0.16800000000000001,null,"Local",null,null,null,null,null,"Data"]
["Estudos e Projetos, Planos e Gerenciamento e outros correlatos","K1","Estudos e Projetos, Planos e Gerenciamento e outros correlatos-K1",null,"-","-","-"]
[{"$f":"A44","v":"Estudos e Projetos, Planos e Gerenciamento e outros correlatos"},"K2","Estudos e Projetos, Planos e Gerenciamento e outros correlatos-K2",null,"-",0.2,"-"]
[{"$f":"A45","v":"Estudos e Projetos, Planos e Gerenciamento e outros correlatos"},"","Estudos e Projetos, Planos e Gerenciamento e outros correlatos-",null,"-","-","-",null,"Responsável Técnico",null,null,null,null,null,"Responsável Tomador"]
[{"$f":"A46","v":"Estudos e Projetos, Planos e Gerenciamento e outros correlatos"},"","Estudos e Projetos, Planos e Gerenciamento e outros correlatos-",null,"-","-","-",null,"Nome:",{"$f":"DADOS!B54","v":"MAX MOOSHAMMER"},null,null,null,null,"Nome:","MELÂNIA AP. ROMAN MENEGHINI"]
[{"$f":"A47","v":"Estudos e Projetos, Planos e Gerenciamento e outros correlatos"},"K3","Estudos e Projetos, Planos e Gerenciamento e outros correlatos-K3",null,"-",0.12,"-",null,"Título:",{"$f":"DADOS!B55","v":"ENGENHEIRO CIVIL"},null,null,null,null,"Cargo:","PREFEITA MUNICIPAL DE VARGEM BONITA"]
[{"$f":"A48","v":"Estudos e Projetos, Planos e Gerenciamento e outros correlatos"},"BDI PAD","Estudos e Projetos, Planos e Gerenciamento e outros correlatos-BDI PAD",null,"-","-","-",null,{"$f":"DADOS!A56","v":"CREA/CAU:"},{"$f":"DADOS!B56","v":"139.164-0"}]
[null,null,null,null,null,null,null,null,{"$f":"DADOS!A57","v":"ART/RRT:"},{"$f":"DADOS!B57","v":"6699689-7"}]
[]
["Construção e Reforma de Edifícios"]
["Construção de Praças Urbanas, Rodovias, Ferrovias e recapeamento e pavimentação de vias urbanas"]
["Construção de Redes de Abastecimento de Água, Coleta de Esgoto"]
["Construção e Manutenção de Estações e Redes de Distribuição de Energia Elétrica"]
["Obras Portuárias, Marítimas e Fluviais"]
["Fornecimento de Materiais e Equipamentos (aquisição indireta - em conjunto com licitação de obras)"]
["Fornecimento de Materiais e Equipamentos (aquisição direta)"]
["Estudos e Projetos, Planos e Gerenciamento e outros correlatos"]

{"sheet":"PO","index":4,"n_rows":182,"n_cols":26,"rows_kept":182,"cut":false,"hidden":false,"merged":[[1,22,1,23],[174,10,174,19],[170,10,172,19],[167,12,167,19],[180,10,180,12],[177,10,177,12]]}
[null,null,null,null,null,null,null,null,null,null,null,null,null,"PO - PLANILHA ORÇAMENTÁRIA",null,null,null,null,null,"Grau de Sigilo"]
[null,"LOTE","Meta","Nível 2","Nível 3","Nível 4","Serviço",null,null,null,null,null,null,{"$f":"CHOOSE(1+LOG(1+2*(TipoOrçamento=\"BASE\")+4*(TipoOrçamento=\"LICITADO\")+8*(TipoOrçamento=\"REPROGRAMADOAC\")+16*(TipoOrçamento=\"REPROGRAMADONPL\"),2),\"nada\",\"Orçamento Base para Licitação\",\"Orçamento Licitado\",\"Orçamento Licitado Reprogramado\",\"Orçamento Base para Licitação - Reprogramado\")","v":"Orçamento Base para Licitação"},null,null,null,null,null,"#PUBLICO",null,null,"Arredondamento"]
[null,null,null,null,null,null,null,null,null,null,null,null,null,null,null,null,null,null,null,null,null,null,"Quantidade",true]
["Nmax",null,null,null,null,null,null,null,null,null,null,null,null,null,null,null,null,null,null,null,"ERRO GERAL",null,"Custo Unitáro",true]
[{"$f":"MAX($A$12:$A$167)","v":2},null,null,null,null,null,null,null,null,null,null,null,null,null,null,null,null,null,null,null,{"$f":"IF(COUNTIF($U$12:OFFSET($U$167,-1,0),\"DESCRIÇÃO\")+COUNTIF($U$12:OFFSET($U$167,-1,0),\"UNIDADE\")+COUNTIF($U$12:OFFSET($U$167,-1,0),\"SEM VALOR\")>0,\"NÃO OK\",\"OK\")","v":"NÃO OK"},"","BDI",true]
[null,null,null,null,null,null,null,null,null,null,null,null,null,null,null,null,null,null,null,null,null,null,"Preço Unitário",true]
[null,null,null,null,null,null,null,null,null,null,null,null,null,null,null,null,null,null,null,null,null,null,"Preço Total",true]
[]
[null,null,null,null,null,null,null,null,null,null,null,null,null,null,null,{"$f":"OFFSET(PLQ!$E$12,ROW($P9)-ROW(P$12),0)","v":"-"}]
["Nível","Altura","n1","n2","n3","n4","n5","Czero","Cnível","Nível","Item","Fonte","Código","Descrição","Unidade","Quantidade",{"$f":"IF(OR(TipoOrçamento=\"LICITADO\",TipoOrçamento=\"REPROGRAMADOAC\"),\"Preço Unitário (R$)\",\"Custo Unitário (R$)\")","v":"Custo Unitário (R$)"},"BDI\n(%)","Preço Unitário (R$)","Preço Total\n(R$)","Erro de Dados","Lista Crono","Concatenação Fonte-Código","BancoRef",{"$f":"IF(TipoOrçamento=\"LICITADO\",\"Preço Unitário Edital (R$)\",\"Custo Unitário Referência (R$)\")","v":"Custo Unitário Referência (R$)"},{"$f":"IF(TipoOrçamento=\"LICITADO\",\"Valor BDI Edital\",\"Valor BDI\")","v":"Valor BDI"}]
[{"$f":"CHOOSE(1+LOG(1+2*(J11=\"Meta\")+4*(J11=\"Nível 2\")+8*(J11=\"Nível 3\")+16*(J11=\"Nível 4\")+32*(J11=\"Serviço\"),2),0,1,2,3,4,\"S\")","v":"S"},{"$f":"IF(OR(A11=\"S\",A11=0),0,IF(ISERROR(I11),H11,SMALL(H11:I11,1)))","v":0},{"$f":"IF($A11=1,OFFSET(C11,-1,0)+1,OFFSET(C11,-1,0))","v":"n1"},{"$f":"IF($A11=1,0,IF($A11=2,OFFSET(D11,-1,0)+1,OFFSET(D11,-1,0)))","v":"n2"},{"$f":"IF(AND($A11<=2,$A11<>0),0,IF($A11=3,OFFSET(E11,-1,0)+1,OFFSET(E11,-1,0)))","v":"n3"},{"$f":"IF(AND($A11<=3,$A11<>0),0,IF($A11=4,OFFSET(F11,-1,0)+1,OFFSET(F11,-1,0)))","v":"n4"},{"$f":"IF(AND($A11<=4,$A11<>0),0,IF($A11=\"S\",OFFSET(G11,-1,0)+1,OFFSET(G11,-1,0)))","v":{"$error":"#VALUE!"}},{"$f":"IF(OR($A11=\"S\",$A11=0),0,MATCH(0,OFFSET($B11,1,$A11,ROW($A$167)-ROW($A11)),0))","v":0},{"$f":"IF(OR($A11=\"S\",$A11=0),0,MATCH(OFFSET($B11,0,$A11)+1,OFFSET($B11,1,$A11,ROW($A$167)-ROW($A11)),0))","v":0},"Serviço",{"$f":"IF($A11=0,\"-\",CONCATENATE(C11&\".\",IF(AND($A$5>=2,$A11>=2),D11&\".\",\"\"),IF(AND($A$5>=3,$A11>=3),E11&\".\",\"\"),IF(AND($A$5>=4,$A11>=4),F11&\".\",\"\"),IF($A11=\"S\",G11&\".\",\"\")))","v":{"$error":"#VALUE!"}},null,null,{"$f":"IF($A11=\"S\",Referencia.Descricao,\"(digite a descrição aqui)\")","v":""},{"$f":"Referencia.Unidade","v":""},{"$f":"OFFSET(PLQ!$E$12,ROW($P11)-ROW(P$12),0)","v":0},null,"BDI 1",{"$f":"IF($A11=\"S\",IF($Q$10=\"Preço Unitário (R$)\",PO.CustoUnitario,ROUND(PO.CustoUnitario*(1+$Z11),15-13*$X$6)),0)","v":0},{"$f":"IF($A11=\"S\",VTOTAL1,IF($A11=0,0,ROUND(SomaAgrup,15-13*$X$7)))","v":0},{"$f":"IF($J11=\"\",\"\",IF($N11=\"\",\"DESCRIÇÃO\",IF(AND($J11=\"Serviço\",$O11=\"\"),\"UNIDADE\",IF($T11<=0,\"SEM VALOR\",IF(AND($Y11<>\"\",$Q11>$Y11),\"ACIMA REF.\",\"\")))))","v":"DESCRIÇÃO"},{"$f":"IF(OR($A11=0,$A11=\"S\",$A11>CFF!$A$9),\"\",MAX(V$12:OFFSET(V11,-1,0))+1)","v":""},{"$f":"IF(AND($J11=\"Serviço\",$M11<>\"\"),IF($L11=\"\",$M11,CONCATENATE($L11,\"-\",$M11)))","v":false},{"$f":"IF(AND(Fonte<>\"\",Código<>\"\"),MATCH(Fonte&\" \"&IF(Fonte=\"sinapi\",SUBSTITUTE(SUBSTITUTE(Código,\"/00\",\"/\"),\"/0\",\"/\"),Código),INDIRECT(\"'[Referência \"&_xlnm.Database&\".xls]Banco'!$a:$a\"),0),\"X\")","v":"X"},{"$f":"IF(Import.Desoneracao=\"sim\",Referencia.Desonerado,Referencia.NaoDesonerado)","v":0},{"$f":"ROUND(IF(ISNUMBER(R11),R11,IF(LEFT(R11,3)=\"BDI\",HLOOKUP(R11,DADOS!$T$37:$X$38,2,FALSE),0)),15-11*$X$5)","v":0.26519999999999999}]
[0,{"$f":"COUNTA(OFFSET(B12,1,0):B$167)","v":154},null,null,null,null,null,null,null,{"$f":"IF(OR(TipoOrçamento=\"LICITADO\",TipoOrçamento=\"REPROGRAMADOAC\"),\"CTEF\",\"LOTE\")","v":"LOTE"},0,null,null,{"$f":"IF(TipoOrçamento=\"LICITADO\",DADOS!O43,DADOS!G38)","v":0},null,null,null,null,null,{"$f":"SUMIF(OFFSET($J12,1,0,ROW(T167)-ROW(T12)-1),\"Serviço\",OFFSET(T12,1,0,ROW(T167)-ROW(T12)-1))","v":994610.41000000027},{"$f":"IF($N12=0,\"DESCRIÇÃO\",\"\")","v":"DESCRIÇÃO"},0]
[{"$f":"CHOOSE(1+LOG(1+2*(J13=\"Meta\")+4*(J13=\"Nível 2\")+8*(J13=\"Nível 3\")+16*(J13=\"Nível 4\")+32*(J13=\"Serviço\"),2),0,1,2,3,4,\"S\")","v":1},{"$f":"IF(OR(A13=\"S\",A13=0),0,IF(ISERROR(I13),H13,SMALL(H13:I13,1)))","v":154},{"$f":"IF($A13=1,OFFSET(C13,-1,0)+1,OFFSET(C13,-1,0))","v":1},{"$f":"IF($A13=1,0,IF($A13=2,OFFSET(D13,-1,0)+1,OFFSET(D13,-1,0)))","v":0},{"$f":"IF(AND($A13<=2,$A13<>0),0,IF($A13=3,OFFSET(E13,-1,0)+1,OFFSET(E13,-1,0)))","v":0},{"$f":"IF(AND($A13<=3,$A13<>0),0,IF($A13=4,OFFSET(F13,-1,0)+1,OFFSET(F13,-1,0)))","v":0},{"$f":"IF(AND($A13<=4,$A13<>0),0,IF($A13=\"S\",OFFSET(G13,-1,0)+1,OFFSET(G13,-1,0)))","v":0},{"$f":"IF(OR($A13=\"S\",$A13=0),0,MATCH(0,OFFSET($B13,1,$A13,ROW($A$167)-ROW($A13)),0))","v":154},{"$f":"IF(OR($A13=\"S\",$A13=0),0,MATCH(OFFSET($B13,0,$A13)+1,OFFSET($B13,1,$A13,ROW($A$167)-ROW($A13)),0))","v":{"$error":"#N/A"}},"Meta",{"$f":"IF($A13=0,\"-\",CONCATENATE(C13&\".\",IF(AND($A$5>=2,$A13>=2),D13&\".\",\"\"),IF(AND($A$5>=3,$A13>=3),E13&\".\",\"\"),IF(AND($A$5>=4,$A13>=4),F13&\".\",\"\"),IF($A13=\"S\",G13&\".\",\"\")))","v":"1."},null,null,"CASA DO PRODUTOR",{"$f":"Referencia.Unidade","v":""},{"$f":"OFFSET(PLQ!$E$12,ROW($P13)-ROW(P$12),0)","v":0},null,"BDI 1",{"$f":"IF($A13=\"S\",IF($Q$10=\"Preço Unitário (R$)\",PO.CustoUnitario,ROUND(PO.CustoUnitario*(1+$Z13),15-13*$X$6)),0)","v":0},{"$f":"IF($A13=\"S\",VTOTAL1,IF($A13=0,0,ROUND(SomaAgrup,15-13*$X$7)))","v":994610.41},{"$f":"IF($J13=\"\",\"\",IF($N13=\"\",\"DESCRIÇÃO\",IF(AND($J13=\"Serviço\",$O13=\"\"),\"UNIDADE\",IF($T13<=0,\"SEM VALOR\",IF(AND($Y13<>\"\",$Q13>$Y13),\"ACIMA REF.\",\"\")))))","v":""},{"$f":"IF(OR($A13=0,$A13=\"S\",$A13>CFF!$A$9),\"\",MAX(V$12:OFFSET(V13,-1,0))+1)","v":1},{"$f":"IF(AND($J13=\"Serviço\",$M13<>\"\"),IF($L13=\"\",$M13,CONCATENATE($L13,\"-\",$M13)))","v":false},{"$f":"IF(AND(Fonte<>\"\",Código<>\"\"),MATCH(Fonte&\" \"&IF(Fonte=\"sinapi\",SUBSTITUTE(SUBSTITUTE(Código,\"/00\",\"/\"),\"/0\",\"/\"),Código),INDIRECT(\"'[Referência \"&_xlnm.Database&\".xls]Banco'!$a:$a\"),0),\"X\")","v":"X"},{"$f":"IF(Import.Desoneracao=\"sim\",Referencia.Desonerado,Referencia.NaoDesonerado)","v":0},{"$f":"ROUND(IF(ISNUMBER(R13),R13,IF(LEFT(R13,3)=\"BDI\",HLOOKUP(R13,DADOS!$T$37:$X$38,2,FALSE),0)),15-11*$X$5)","v":0.26519999999999999}]
[{"$f":"CHOOSE(1+LOG(1+2*(J14=\"Meta\")+4*(J14=\"Nível 2\")+8*(J14=\"Nível 3\")+16*(J14=\"Nível 4\")+32*(J14=\"Serviço\"),2),0,1,2,3,4,\"S\")","v":2},{"$f":"IF(OR(A14=\"S\",A14=0),0,IF(ISERROR(I14),H14,SMALL(H14:I14,1)))","v":4},{"$f":"IF($A14=1,OFFSET(C14,-1,0)+1,OFFSET(C14,-1,0))","v":1},{"$f":"IF($A14=1,0,IF($A14=2,OFFSET(D14,-1,0)+1,OFFSET(D14,-1,0)))","v":1},{"$f":"IF(AND($A14<=2,$A14<>0),0,IF($A14=3,OFFSET(E14,-1,0)+1,OFFSET(E14,-1,0)))","v":0},{"$f":"IF(AND($A14<=3,$A14<>0),0,IF($A14=4,OFFSET(F14,-1,0)+1,OFFSET(F14,-1,0)))","v":0},{"$f":"IF(AND($A14<=4,$A14<>0),0,IF($A14=\"S\",OFFSET(G14,-1,0)+1,OFFSET(G14,-1,0)))","v":0},153,4,"Nível 2",{"$f":"IF($A14=0,\"-\",CONCATENATE(C14&\".\",IF(AND($A$5>=2,$A14>=2),D14&\".\",\"\"),IF(AND($A$5>=3,$A14>=3),E14&\".\",\"\"),IF(AND($A$5>=4,$A14>=4),F14&\".\",\"\"),IF($A14=\"S\",G14&\".\",\"\")))","v":"1.1."},"SINAPI","74209/001","SERVIÇOS INICIAIS",{"$f":"Referencia.Unidade","v":"M2"},{"$f":"OFFSET(PLQ!$E$12,ROW($P14)-ROW(P$12),0)","v":0},null,"BDI 1",{"$f":"IF($A14=\"S\",IF($Q$10=\"Preço Unitário (R$)\",PO.CustoUnitario,ROUND(PO.CustoUnitario*(1+$Z14),15-13*$X$6)),0)","v":0},{"$f":"IF($A14=\"S\",VTOTAL1,IF($A14=0,0,ROUND(SomaAgrup,15-13*$X$7)))","v":2662.77},{"$f":"IF($J14=\"\",\"\",IF($N14=\"\",\"DESCRIÇÃO\",IF(AND($J14=\"Serviço\",$O14=\"\"),\"UNIDADE\",IF($T14<=0,\"SEM VALOR\",IF(AND($Y14<>\"\",$Q14>$Y14),\"ACIMA REF.\",\"\")))))","v":""},{"$f":"IF(OR($A14=0,$A14=\"S\",$A14>CFF!$A$9),\"\",MAX(V$12:OFFSET(V14,-1,0))+1)","v":2},{"$f":"IF(AND($J14=\"Serviço\",$M14<>\"\"),IF($L14=\"\",$M14,CONCATENATE($L14,\"-\",$M14)))","v":false},{"$f":"IF(AND(Fonte<>\"\",Código<>\"\"),MATCH(Fonte&\" \"&IF(Fonte=\"sinapi\",SUBSTITUTE(SUBSTITUTE(Código,\"/00\",\"/\"),\"/0\",\"/\"),Código),INDIRECT(\"'[Referência \"&_xlnm.Database&\".xls]Banco'!$a:$a\"),0),\"X\")","v":5982},{"$f":"IF(Import.Desoneracao=\"sim\",Referencia.Desonerado,Referencia.NaoDesonerado)","v":308.89},{"$f":"ROUND(IF(ISNUMBER(R14),R14,IF(LEFT(R14,3)=\"BDI\",HLOOKUP(R14,DADOS!$T$37:$X$38,2,FALSE),0)),15-11*$X$5)","v":0.26519999999999999}]
[{"$f":"CHOOSE(1+LOG(1+2*(J15=\"Meta\")+4*(J15=\"Nível 2\")+8*(J15=\"Nível 3\")+16*(J15=\"Nível 4\")+32*(J15=\"Serviço\"),2),0,1,2,3,4,\"S\")","v":"S"},{"$f":"IF(OR(A15=\"S\",A15=0),0,IF(ISERROR(I15),H15,SMALL(H15:I15,1)))","v":0},{"$f":"IF($A15=1,OFFSET(C15,-1,0)+1,OFFSET(C15,-1,0))","v":1},{"$f":"IF($A15=1,0,IF($A15=2,OFFSET(D15,-1,0)+1,OFFSET(D15,-1,0)))","v":1},{"$f":"IF(AND($A15<=2,$A15<>0),0,IF($A15=3,OFFSET(E15,-1,0)+1,OFFSET(E15,-1,0)))","v":0},{"$f":"IF(AND($A15<=3,$A15<>0),0,IF($A15=4,OFFSET(F15,-1,0)+1,OFFSET(F15,-1,0)))","v":0},{"$f":"IF(AND($A15<=4,$A15<>0),0,IF($A15=\"S\",OFFSET(G15,-1,0)+1,OFFSET(G15,-1,0)))","v":1},0,0,"Serviço",{"$f":"IF($A15=0,\"-\",CONCATENATE(C15&\".\",IF(AND($A$5>=2,$A15>=2),D15&\".\",\"\"),IF(AND($A$5>=3,$A15>=3),E15&\".\",\"\"),IF(AND($A$5>=4,$A15>=4),F15&\".\",\"\"),IF($A15=\"S\",G15&\".\",\"\")))","v":"1.1.1."},"SINAPI","74209/001","PLACA DE OBRA EM CHAPA DE ACO GALVANIZADO PADRÃO GOVERNO FEDERAL","M2",{"$f":"OFFSET(PLQ!$E$12,ROW($P15)-ROW(P$12),0)","v":2.5},262.56,"BDI 1",332.19,830.48,{"$f":"IF($J15=\"\",\"\",IF($N15=\"\",\"DESCRIÇÃO\",IF(AND($J15=\"Serviço\",$O15=\"\"),\"UNIDADE\",IF($T15<=0,\"SEM VALOR\",IF(AND($Y15<>\"\",$Q15>$Y15),\"ACIMA REF.\",\"\")))))","v":""},{"$f":"IF(OR($A15=0,$A15=\"S\",$A15>CFF!$A$9),\"\",MAX(V$12:OFFSET(V15,-1,0))+1)","v":""},{"$f":"IF(AND($J15=\"Serviço\",$M15<>\"\"),IF($L15=\"\",$M15,CONCATENATE($L15,\"-\",$M15)))","v":"SINAPI-74209/001"},5982,{"$f":"IF(Import.Desoneracao=\"sim\",Referencia.Desonerado,Referencia.NaoDesonerado)","v":308.89},{"$f":"ROUND(IF(ISNUMBER(R15),R15,IF(LEFT(R15,3)=\"BDI\",HLOOKUP(R15,DADOS!$T$37:$X$38,2,FALSE),0)),15-11*$X$5)","v":0.26519999999999999}]
[{"$f":"CHOOSE(1+LOG(1+2*(J16=\"Meta\")+4*(J16=\"Nível 2\")+8*(J16=\"Nível 3\")+16*(J16=\"Nível 4\")+32*(J16=\"Serviço\"),2),0,1,2,3,4,\"S\")","v":"S"},{"$f":"IF(OR(A16=\"S\",A16=0),0,IF(ISERROR(I16),H16,SMALL(H16:I16,1)))","v":0},{"$f":"IF($A16=1,OFFSET(C16,-1,0)+1,OFFSET(C16,-1,0))","v":1},{"$f":"IF($A16=1,0,IF($A16=2,OFFSET(D16,-1,0)+1,OFFSET(D16,-1,0)))","v":1},{"$f":"IF(AND($A16<=2,$A16<>0),0,IF($A16=3,OFFSET(E16,-1,0)+1,OFFSET(E16,-1,0)))","v":0},{"$f":"IF(AND($A16<=3,$A16<>0),0,IF($A16=4,OFFSET(F16,-1,0)+1,OFFSET(F16,-1,0)))","v":0},{"$f":"IF(AND($A16<=4,$A16<>0),0,IF($A16=\"S\",OFFSET(G16,-1,0)+1,OFFSET(G16,-1,0)))","v":2},0,0,"Serviço",{"$f":"IF($A16=0,\"-\",CONCATENATE(C16&\".\",IF(AND($A$5>=2,$A16>=2),D16&\".\",\"\"),IF(AND($A$5>=3,$A16>=3),E16&\".\",\"\"),IF(AND($A$5>=4,$A16>=4),F16&\".\",\"\"),IF($A16=\"S\",G16&\".\",\"\")))","v":"1.1.2."},"SINAPI","74209/001","PLACA DE OBRA EM CHAPA DE ACO GALVANIZADO PADRÃO AMMOC","M2",{"$f":"OFFSET(PLQ!$E$12,ROW($P16)-ROW(P$12),0)","v":2.5},262.56,"BDI 1",332.19,830.48,{"$f":"IF($J16=\"\",\"\",IF($N16=\"\",\"DESCRIÇÃO\",IF(AND($J16=\"Serviço\",$O16=\"\"),\"UNIDADE\",IF($T16<=0,\"SEM VALOR\",IF(AND($Y16<>\"\",$Q16>$Y16),\"ACIMA REF.\",\"\")))))","v":""},{"$f":"IF(OR($A16=0,$A16=\"S\",$A16>CFF!$A$9),\"\",MAX(V$12:OFFSET(V16,-1,0))+1)","v":""},{"$f":"IF(AND($J16=\"Serviço\",$M16<>\"\"),IF($L16=\"\",$M16,CONCATENATE($L16,\"-\",$M16)))","v":"SINAPI-74209/001"},5982,{"$f":"IF(Import.Desoneracao=\"sim\",Referencia.Desonerado,Referencia.NaoDesonerado)","v":308.89},{"$f":"ROUND(IF(ISNUMBER(R16),R16,IF(LEFT(R16,3)=\"BDI\",HLOOKUP(R16,DADOS!$T$37:$X$38,2,FALSE),0)),15-11*$X$5)","v":0.26519999999999999}]
["S",0,1,1,0,0,3,0,0,"Serviço","1.1.3.","SINAPI","74077/002","LOCACAO CONVENCIONAL DE OBRA, ATRAVÉS DE GABARITO DE TABUAS CORRIDAS PONTALETADAS","M2",{"$f":"OFFSET(PLQ!$E$12,ROW($P17)-ROW(P$12),0)","v":317.02999999999997},2.5,"BDI 1",3.16,1001.81,"",{"$f":"IF(OR($A17=0,$A17=\"S\",$A17>CFF!$A$9),\"\",MAX(V$12:OFFSET(V17,-1,0))+1)","v":""},"SINAPI-74077/002",11759,{"$f":"IF(Import.Desoneracao=\"sim\",Referencia.Desonerado,Referencia.NaoDesonerado)","v":4.05},{"$f":"ROUND(IF(ISNUMBER(R17),R17,IF(LEFT(R17,3)=\"BDI\",HLOOKUP(R17,DADOS!$T$37:$X$38,2,FALSE),0)),15-11*$X$5)","v":0.26519999999999999}]
[2,3,1,2,0,0,0,149,3,"Nível 2","1.2.",null,null,"ESCAVAÇÔES E REATERRO",{"$f":"Referencia.Unidade","v":""},{"$f":"OFFSET(PLQ!$E$12,ROW($P18)-ROW(P$12),0)","v":0},{"$f":"Y18*0.85","v":0},"BDI 1",0,624.72,"",{"$f":"IF(OR($A18=0,$A18=\"S\",$A18>CFF!$A$9),\"\",MAX(V$12:OFFSET(V18,-1,0))+1)","v":3},false,"X",{"$f":"IF(Import.Desoneracao=\"sim\",Referencia.Desonerado,Referencia.NaoDesonerado)","v":0},{"$f":"ROUND(IF(ISNUMBER(R18),R18,IF(LEFT(R18,3)=\"BDI\",HLOOKUP(R18,DADOS!$T$37:$X$38,2,FALSE),0)),15-11*$X$5)","v":0.26519999999999999}]
["S",0,1,2,0,0,1,0,0,"Serviço","1.2.1.","SINAPI","90106","ESCAVAÇÃO DE VALA COM PROFUNDIDADE ATÉ 1,5 M ","M3",{"$f":"OFFSET(PLQ!$E$12,ROW($P19)-ROW(P$12),0)","v":59.08},4.4800000000000004,"BDI 1",5.67,334.98,"",{"$f":"IF(OR($A19=0,$A19=\"S\",$A19>CFF!$A$9),\"\",MAX(V$12:OFFSET(V19,-1,0))+1)","v":""},"SINAPI-90106",10402,{"$f":"IF(Import.Desoneracao=\"sim\",Referencia.Desonerado,Referencia.NaoDesonerado)","v":5.27},{"$f":"ROUND(IF(ISNUMBER(R19),R19,IF(LEFT(R19,3)=\"BDI\",HLOOKUP(R19,DADOS!$T$37:$X$38,2,FALSE),0)),15-11*$X$5)","v":0.26519999999999999}]
["S",0,1,2,0,0,2,0,0,"Serviço","1.2.2.","SINAPI","93382","REATERRO MANUAL DE VALAS COM COMPACTAÇÃO ","M3",{"$f":"OFFSET(PLQ!$E$12,ROW($P20)-ROW(P$12),0)","v":13.47},17,"BDI 1",21.51,289.74,"",{"$f":"IF(OR($A20=0,$A20=\"S\",$A20>CFF!$A$9),\"\",MAX(V$12:OFFSET(V20,-1,0))+1)","v":""},"SINAPI-93382",10456,{"$f":"IF(Import.Desoneracao=\"sim\",Referencia.Desonerado,Referencia.NaoDesonerado)","v":22.14},{"$f":"ROUND(IF(ISNUMBER(R20),R20,IF(LEFT(R20,3)=\"BDI\",HLOOKUP(R20,DADOS!$T$37:$X$38,2,FALSE),0)),15-11*$X$5)","v":0.26519999999999999}]
[2,6,1,3,0,0,0,146,6,"Nível 2","1.3.","SINAPI",null,"FUNDAÇÕES: BLOCOS E BALDRAMES",{"$f":"Referencia.Unidade","v":""},{"$f":"OFFSET(PLQ!$E$12,ROW($P21)-ROW(P$12),0)","v":0},0,"BDI 1",0,73549.06,"",{"$f":"IF(OR($A21=0,$A21=\"S\",$A21>CFF!$A$9),\"\",MAX(V$12:OFFSET(V21,-1,0))+1)","v":4},false,"X",{"$f":"IF(Import.Desoneracao=\"sim\",Referencia.Desonerado,Referencia.NaoDesonerado)","v":0},{"$f":"ROUND(IF(ISNUMBER(R21),R21,IF(LEFT(R21,3)=\"BDI\",HLOOKUP(R21,DADOS!$T$37:$X$38,2,FALSE),0)),15-11*$X$5)","v":0.26519999999999999}]
["S",0,1,3,0,0,1,0,0,"Serviço","1.3.1.","SINAPI","90883","ESTACA ESCAVADA MECANICAMENTE, SEM FLUIDO ESTABILIZANTE, COM 40 CM DE DIÂMETRO, ATÉ 9 M DE COMPRIMENTO, CONCRETO LANÇADO POR CAMINHÃO BETONEIRA ","M",{"$f":"OFFSET(PLQ!$E$12,ROW($P22)-ROW(P$12),0)","v":235},52.92,"BDI 1",66.95,15733.25,"",{"$f":"IF(OR($A22=0,$A22=\"S\",$A22>CFF!$A$9),\"\",MAX(V$12:OFFSET(V22,-1,0))+1)","v":""},"SINAPI-90883",7527,{"$f":"IF(Import.Desoneracao=\"sim\",Referencia.Desonerado,Referencia.NaoDesonerado)","v":62.26},{"$f":"ROUND(IF(ISNUMBER(R22),R22,IF(LEFT(R22,3)=\"BDI\",HLOOKUP(R22,DADOS!$T$37:$X$38,2,FALSE),0)),15-11*$X$5)","v":0.26519999999999999}]
["S",0,1,3,0,0,2,0,0,"Serviço","1.3.2.","SINAPI-I","4718","PEDRA BRITADA N. 2 PARA LASTRO","M3",{"$f":"OFFSET(PLQ!$E$12,ROW($P23)-ROW(P$12),0)","v":1.94},51,"BDI 1",64.53,125.19,"",{"$f":"IF(OR($A23=0,$A23=\"S\",$A23>CFF!$A$9),\"\",MAX(V$12:OFFSET(V23,-1,0))+1)","v":""},"SINAPI-I-4718",3906,{"$f":"IF(Import.Desoneracao=\"sim\",Referencia.Desonerado,Referencia.NaoDesonerado)","v":60},{"$f":"ROUND(IF(ISNUMBER(R23),R23,IF(LEFT(R23,3)=\"BDI\",HLOOKUP(R23,DADOS!$T$37:$X$38,2,FALSE),0)),15-11*$X$5)","v":0.26519999999999999}]
["S",0,1,3,0,0,3,0,0,"Serviço","1.3.3.","AMMOC","35","BLOCOS EM CONCRETO ARMADO, Fck=30 Mpa","M3",{"$f":"OFFSET(PLQ!$E$12,ROW($P24)-ROW(P$12),0)","v":17.3},1400,"BDI 1",1771.28,30643.14,"",{"$f":"IF(OR($A24=0,$A24=\"S\",$A24>CFF!$A$9),\"\",MAX(V$12:OFFSET(V24,-1,0))+1)","v":""},"AMMOC-35",54,{"$f":"IF(Import.Desoneracao=\"sim\",Referencia.Desonerado,Referencia.NaoDesonerado)","v":1984.1200000000001},{"$f":"ROUND(IF(ISNUMBER(R24),R24,IF(LEFT(R24,3)=\"BDI\",HLOOKUP(R24,DADOS!$T$37:$X$38,2,FALSE),0)),15-11*$X$5)","v":0.26519999999999999}]
[{"$f":"CHOOSE(1+LOG(1+2*(J25=\"Meta\")+4*(J25=\"Nível 2\")+8*(J25=\"Nível 3\")+16*(J25=\"Nível 4\")+32*(J25=\"Serviço\"),2),0,1,2,3,4,\"S\")","v":"S"},{"$f":"IF(OR(A25=\"S\",A25=0),0,IF(ISERROR(I25),H25,SMALL(H25:I25,1)))","v":0},{"$f":"IF($A25=1,OFFSET(C25,-1,0)+1,OFFSET(C25,-1,0))","v":1},{"$f":"IF($A25=1,0,IF($A25=2,OFFSET(D25,-1,0)+1,OFFSET(D25,-1,0)))","v":3},{"$f":"IF(AND($A25<=2,$A25<>0),0,IF($A25=3,OFFSET(E25,-1,0)+1,OFFSET(E25,-1,0)))","v":0},{"$f":"IF(AND($A25<=3,$A25<>0),0,IF($A25=4,OFFSET(F25,-1,0)+1,OFFSET(F25,-1,0)))","v":0},{"$f":"IF(AND($A25<=4,$A25<>0),0,IF($A25=\"S\",OFFSET(G25,-1,0)+1,OFFSET(G25,-1,0)))","v":4},0,0,"Serviço",{"$f":"IF($A25=0,\"-\",CONCATENATE(C25&\".\",IF(AND($A$5>=2,$A25>=2),D25&\".\",\"\"),IF(AND($A$5>=3,$A25>=3),E25&\".\",\"\"),IF(AND($A$5>=4,$A25>=4),F25&\".\",\"\"),IF($A25=\"S\",G25&\".\",\"\")))","v":"1.3.4."},"AMMOC","35","VIGAS BALDRAMES EM CONCRETO ARMADO, Fck=30 Mpa","M3",{"$f":"OFFSET(PLQ!$E$12,ROW($P25)-ROW(P$12),0)","v":14.2},1400,"BDI 1",{"$f":"IF($A25=\"S\",IF($Q$10=\"Preço Unitário (R$)\",PO.CustoUnitario,ROUND(PO.CustoUnitario*(1+$Z25),15-13*$X$6)),0)","v":1771.28},{"$f":"IF($A25=\"S\",VTOTAL1,IF($A25=0,0,ROUND(SomaAgrup,15-13*$X$7)))","v":25152.18},{"$f":"IF($J25=\"\",\"\",IF($N25=\"\",\"DESCRIÇÃO\",IF(AND($J25=\"Serviço\",$O25=\"\"),\"UNIDADE\",IF($T25<=0,\"SEM VALOR\",IF(AND($Y25<>\"\",$Q25>$Y25),\"ACIMA REF.\",\"\")))))","v":""},{"$f":"IF(OR($A25=0,$A25=\"S\",$A25>CFF!$A$9),\"\",MAX(V$12:OFFSET(V25,-1,0))+1)","v":""},{"$f":"IF(AND($J25=\"Serviço\",$M25<>\"\"),IF($L25=\"\",$M25,CONCATENATE($L25,\"-\",$M25)))","v":"AMMOC-35"},{"$f":"IF(AND(Fonte<>\"\",Código<>\"\"),MATCH(Fonte&\" \"&IF(Fonte=\"sinapi\",SUBSTITUTE(SUBSTITUTE(Código,\"/00\",\"/\"),\"/0\",\"/\"),Código),INDIRECT(\"'[Referência \"&_xlnm.Database&\".xls]Banco'!$a:$a\"),0),\"X\")","v":54},{"$f":"IF(Import.Desoneracao=\"sim\",Referencia.Desonerado,Referencia.NaoDesonerado)","v":1984.1200000000001},{"$f":"ROUND(IF(ISNUMBER(R25),R25,IF(LEFT(R25,3)=\"BDI\",HLOOKUP(R25,DADOS!$T$37:$X$38,2,FALSE),0)),15-11*$X$5)","v":0.26519999999999999}]
["S",0,1,3,0,0,5,0,0,"Serviço","1.3.5.","SINAPI","74106/001","IMPERMEABILIZACAO DOS BALDRAMES COM TINTA ASFALTICA, DUAS DEMAOS.","M2",{"$f":"OFFSET(PLQ!$E$12,ROW($P26)-ROW(P$12),0)","v":194.99},7.68,"BDI 1",9.7200000000000006,1895.3,"",{"$f":"IF(OR($A26=0,$A26=\"S\",$A26>CFF!$A$9),\"\",MAX(V$12:OFFSET(V26,-1,0))+1)","v":""},"SINAPI-74106/001",8062,{"$f":"IF(Import.Desoneracao=\"sim\",Referencia.Desonerado,Referencia.NaoDesonerado)","v":9.0299999999999994},{"$f":"ROUND(IF(ISNUMBER(R26),R26,IF(LEFT(R26,3)=\"BDI\",HLOOKUP(R26,DADOS!$T$37:$X$38,2,FALSE),0)),15-11*$X$5)","v":0.26519999999999999}]
[2,2,1,4,0,0,0,140,2,"Nível 2","1.4.",null,null,"ESTRUTURA: VIGAS ",{"$f":"Referencia.Unidade","v":""},{"$f":"OFFSET(PLQ!$E$12,ROW($P27)-ROW(P$12),0)","v":0},null,"BDI 1",0,59869.26,"",{"$f":"IF(OR($A27=0,$A27=\"S\",$A27>CFF!$A$9),\"\",MAX(V$12:OFFSET(V27,-1,0))+1)","v":5},false,"X",{"$f":"IF(Import.Desoneracao=\"sim\",Referencia.Desonerado,Referencia.NaoDesonerado)","v":0},{"$f":"ROUND(IF(ISNUMBER(R27),R27,IF(LEFT(R27,3)=\"BDI\",HLOOKUP(R27,DADOS!$T$37:$X$38,2,FALSE),0)),15-11*$X$5)","v":0.26519999999999999}]
["S",0,1,4,0,0,1,0,0,"Serviço","1.4.1.","AMMOC","35","VIGAS EM CONCRETO ARMADO, Fck= 30 Mpa","M3",{"$f":"OFFSET(PLQ!$E$12,ROW($P28)-ROW(P$12),0)","v":33.799999999999997},1400,"BDI 1",1771.28,59869.26,"",{"$f":"IF(OR($A28=0,$A28=\"S\",$A28>CFF!$A$9),\"\",MAX(V$12:OFFSET(V28,-1,0))+1)","v":""},"AMMOC-35",54,{"$f":"IF(Import.Desoneracao=\"sim\",Referencia.Desonerado,Referencia.NaoDesonerado)","v":1984.1200000000001},{"$f":"ROUND(IF(ISNUMBER(R28),R28,IF(LEFT(R28,3)=\"BDI\",HLOOKUP(R28,DADOS!$T$37:$X$38,2,FALSE),0)),15-11*$X$5)","v":0.26519999999999999}]
[2,2,1,5,0,0,0,138,2,"Nível 2","1.5.",null,null,"ESTRUTURA: PILARES",{"$f":"Referencia.Unidade","v":""},{"$f":"OFFSET(PLQ!$E$12,ROW($P29)-ROW(P$12),0)","v":0},null,"BDI 1",0,50658.61,"",{"$f":"IF(OR($A29=0,$A29=\"S\",$A29>CFF!$A$9),\"\",MAX(V$12:OFFSET(V29,-1,0))+1)","v":6},false,"X",{"$f":"IF(Import.Desoneracao=\"sim\",Referencia.Desonerado,Referencia.NaoDesonerado)","v":0},{"$f":"ROUND(IF(ISNUMBER(R29),R29,IF(LEFT(R29,3)=\"BDI\",HLOOKUP(R29,DADOS!$T$37:$X$38,2,FALSE),0)),15-11*$X$5)","v":0.26519999999999999}]
["S",0,1,5,0,0,1,0,0,"Serviço","1.5.1.","AMMOC","35","PILARES EM CONCRETO ARMADO, Fck= 30 Mpa","M3",{"$f":"OFFSET(PLQ!$E$12,ROW($P30)-ROW(P$12),0)","v":28.6},1400,"BDI 1",1771.28,50658.61,"",{"$f":"IF(OR($A30=0,$A30=\"S\",$A30>CFF!$A$9),\"\",MAX(V$12:OFFSET(V30,-1,0))+1)","v":""},"AMMOC-35",54,{"$f":"IF(Import.Desoneracao=\"sim\",Referencia.Desonerado,Referencia.NaoDesonerado)","v":1984.1200000000001},{"$f":"ROUND(IF(ISNUMBER(R30),R30,IF(LEFT(R30,3)=\"BDI\",HLOOKUP(R30,DADOS!$T$37:$X$38,2,FALSE),0)),15-11*$X$5)","v":0.26519999999999999}]
[2,2,1,6,0,0,0,136,2,"Nível 2","1.6.",null,null,"ESTRUTURA: ESCADAS",{"$f":"Referencia.Unidade","v":""},{"$f":"OFFSET(PLQ!$E$12,ROW($P31)-ROW(P$12),0)","v":0},null,"BDI 1",0,3542.56,"",{"$f":"IF(OR($A31=0,$A31=\"S\",$A31>CFF!$A$9),\"\",MAX(V$12:OFFSET(V31,-1,0))+1)","v":7},false,"X",{"$f":"IF(Import.Desoneracao=\"sim\",Referencia.Desonerado,Referencia.NaoDesonerado)","v":0},{"$f":"ROUND(IF(ISNUMBER(R31),R31,IF(LEFT(R31,3)=\"BDI\",HLOOKUP(R31,DADOS!$T$37:$X$38,2,FALSE),0)),15-11*$X$5)","v":0.26519999999999999}]
["S",0,1,6,0,0,1,0,0,"Serviço","1.6.1.","AMMOC","35","ESCADAS EM CONCRETO ARMADO, Fck= 30 Mpa","M3",{"$f":"OFFSET(PLQ!$E$12,ROW($P32)-ROW(P$12),0)","v":2},1400,"BDI 1",1771.28,3542.56,"",{"$f":"IF(OR($A32=0,$A32=\"S\",$A32>CFF!$A$9),\"\",MAX(V$12:OFFSET(V32,-1,0))+1)","v":""},"AMMOC-35",54,{"$f":"IF(Import.Desoneracao=\"sim\",Referencia.Desonerado,Referencia.NaoDesonerado)","v":1984.1200000000001},{"$f":"ROUND(IF(ISNUMBER(R32),R32,IF(LEFT(R32,3)=\"BDI\",HLOOKUP(R32,DADOS!$T$37:$X$38,2,FALSE),0)),15-11*$X$5)","v":0.26519999999999999}]
[2,4,1,7,0,0,0,134,4,"Nível 2","1.7.",null,null,"LAJES",{"$f":"Referencia.Unidade","v":""},{"$f":"OFFSET(PLQ!$E$12,ROW($P33)-ROW(P$12),0)","v":0},null,"BDI 1",0,153408.95999999999,"",{"$f":"IF(OR($A33=0,$A33=\"S\",$A33>CFF!$A$9),\"\",MAX(V$12:OFFSET(V33,-1,0))+1)","v":8},false,"X",{"$f":"IF(Import.Desoneracao=\"sim\",Referencia.Desonerado,Referencia.NaoDesonerado)","v":0},{"$f":"ROUND(IF(ISNUMBER(R33),R33,IF(LEFT(R33,3)=\"BDI\",HLOOKUP(R33,DADOS!$T$37:$X$38,2,FALSE),0)),15-11*$X$5)","v":0.26519999999999999}]
["S",0,1,7,0,0,1,0,0,"Serviço","1.7.1.","COMPOSIÇÂO","LAJE 2","LAJE NERVURADA, INCLUSIVE FORMAS, LANÇAMENTO, ADENSAMENTO E CAPA EM CONCRETO E= 16 + 4 CM","M2",{"$f":"OFFSET(PLQ!$E$12,ROW($P34)-ROW(P$12),0)","v":535.41},199.94,"BDI 1",252.96,135437.31,"",{"$f":"IF(OR($A34=0,$A34=\"S\",$A34>CFF!$A$9),\"\",MAX(V$12:OFFSET(V34,-1,0))+1)","v":""},"COMPOSIÇÂO-LAJE 2",29,{"$f":"IF(Import.Desoneracao=\"sim\",Referencia.Desonerado,Referencia.NaoDesonerado)","v":235.21999999999997},{"$f":"ROUND(IF(ISNUMBER(R34),R34,IF(LEFT(R34,3)=\"BDI\",HLOOKUP(R34,DADOS!$T$37:$X$38,2,FALSE),0)),15-11*$X$5)","v":0.26519999999999999}]
["S",0,1,7,0,0,2,0,0,"Serviço","1.7.2.","AMMOC","35","LAJES EM CONCRETO ARMADO, Fck= 30 Mpa","M3",{"$f":"OFFSET(PLQ!$E$12,ROW($P35)-ROW(P$12),0)","v":6.88},1400,"BDI 1",1771.28,12186.41,"",{"$f":"IF(OR($A35=0,$A35=\"S\",$A35>CFF!$A$9),\"\",MAX(V$12:OFFSET(V35,-1,0))+1)","v":""},"AMMOC-35",54,{"$f":"IF(Import.Desoneracao=\"sim\",Referencia.Desonerado,Referencia.NaoDesonerado)","v":1984.1200000000001},{"$f":"ROUND(IF(ISNUMBER(R35),R35,IF(LEFT(R35,3)=\"BDI\",HLOOKUP(R35,DADOS!$T$37:$X$38,2,FALSE),0)),15-11*$X$5)","v":0.26519999999999999}]
["S",0,1,7,0,0,3,0,0,"Serviço","1.7.3.","SINAPI","98547","IMPERMEABILIZACAO DE LAJES E MARQUISES DESCOBERTAS, COM MANTA ASFALTICA, 2 CAMADAS, INCLUSIVE APLICAÇÃO DE PRIMER ASFALTICO, ESP= 3mm e 4 mm","M2",{"$f":"OFFSET(PLQ!$E$12,ROW($P36)-ROW(P$12),0)","v":50.65},90.28,"BDI 1",114.22,5785.24,"",{"$f":"IF(OR($A36=0,$A36=\"S\",$A36>CFF!$A$9),\"\",MAX(V$12:OFFSET(V36,-1,0))+1)","v":""},"SINAPI-98547",8059,{"$f":"IF(Import.Desoneracao=\"sim\",Referencia.Desonerado,Referencia.NaoDesonerado)","v":106.21},{"$f":"ROUND(IF(ISNUMBER(R36),R36,IF(LEFT(R36,3)=\"BDI\",HLOOKUP(R36,DADOS!$T$37:$X$38,2,FALSE),0)),15-11*$X$5)","v":0.26519999999999999}]
[2,8,1,8,0,0,0,130,8,"Nível 2","1.8.",null,null,"ALVENARIA E FECHAMENTOS",{"$f":"Referencia.Unidade","v":""},{"$f":"OFFSET(PLQ!$E$12,ROW($P37)-ROW(P$12),0)","v":0},null,"BDI 1",0,85410.81,"",{"$f":"IF(OR($A37=0,$A37=\"S\",$A37>CFF!$A$9),\"\",MAX(V$12:OFFSET(V37,-1,0))+1)","v":9},false,"X",{"$f":"IF(Import.Desoneracao=\"sim\",Referencia.Desonerado,Referencia.NaoDesonerado)","v":0},{"$f":"ROUND(IF(ISNUMBER(R37),R37,IF(LEFT(R37,3)=\"BDI\",HLOOKUP(R37,DADOS!$T$37:$X$38,2,FALSE),0)),15-11*$X$5)","v":0.26519999999999999}]
["S",0,1,8,0,0,1,0,0,"Serviço","1.8.1.","SINAPI",87491,"ALVENARIA DE VEDAÇÃO DE BLOCOS CERÂMICOS FURADOS NA VERTICAL DE 14X19X39CM (ESPESSURA 14CM) DE PAREDES E ARGAMASSA DE ASSENTAMENTO ","M2",{"$f":"OFFSET(PLQ!$E$12,ROW($P38)-ROW(P$12),0)","v":1162.71},44.32,"BDI 1",56.07,65193.15,"",{"$f":"IF(OR($A38=0,$A38=\"S\",$A38>CFF!$A$9),\"\",MAX(V$12:OFFSET(V38,-1,0))+1)","v":""},"SINAPI-87491",10546,{"$f":"IF(Import.Desoneracao=\"sim\",Referencia.Desonerado,Referencia.NaoDesonerado)","v":52.14},{"$f":"ROUND(IF(ISNUMBER(R38),R38,IF(LEFT(R38,3)=\"BDI\",HLOOKUP(R38,DADOS!$T$37:$X$38,2,FALSE),0)),15-11*$X$5)","v":0.26519999999999999}]
["S",0,1,8,0,0,2,0,0,"Serviço","1.8.2.","SINAPI","96364","PAREDE COM PLACAS DE GESSO ACARTONADO (DRYWALL), PARA USO INTERNO COM UMA FACE SIMPLES E OUTRA FACE DUPLA E ESTRUTURA METÁLICA COM GUIAS DUPLAS","M2",{"$f":"OFFSET(PLQ!$E$12,ROW($P39)-ROW(P$12),0)","v":49.4},104.39,"BDI 1",132.07,6524.26,"",{"$f":"IF(OR($A39=0,$A39=\"S\",$A39>CFF!$A$9),\"\",MAX(V$12:OFFSET(V39,-1,0))+1)","v":""},"SINAPI-96364",10701,{"$f":"IF(Import.Desoneracao=\"sim\",Referencia.Desonerado,Referencia.NaoDesonerado)","v":122.81},{"$f":"ROUND(IF(ISNUMBER(R39),R39,IF(LEFT(R39,3)=\"BDI\",HLOOKUP(R39,DADOS!$T$37:$X$38,2,FALSE),0)),15-11*$X$5)","v":0.26519999999999999}]
["S",0,1,8,0,0,3,0,0,"Serviço","1.8.3.","SINAPI","73774/1","DIVISORIA EM MARMORITE ESPESSURA 35MM, CHUMBAMENTO NO PISO E PAREDE COM ARGAMASSA DE CIMENTO E AREIA, POLIMENTO MANUAL","M2",{"$f":"OFFSET(PLQ!$E$12,ROW($P40)-ROW(P$12),0)","v":17.38},234.18,"BDI 1",296.27999999999997,5149.3500000000004,"",{"$f":"IF(OR($A40=0,$A40=\"S\",$A40>CFF!$A$9),\"\",MAX(V$12:OFFSET(V40,-1,0))+1)","v":""},"SINAPI-73774/1",10691,{"$f":"IF(Import.Desoneracao=\"sim\",Referencia.Desonerado,Referencia.NaoDesonerado)","v":275.5},{"$f":"ROUND(IF(ISNUMBER(R40),R40,IF(LEFT(R40,3)=\"BDI\",HLOOKUP(R40,DADOS!$T$37:$X$38,2,FALSE),0)),15-11*$X$5)","v":0.26519999999999999}]
["S",0,1,8,0,0,4,0,0,"Serviço","1.8.4.","SINAPI","84863","GUARDA-CORPO COM CORRIMAO EM TUBO DE ACO GALVANIZADO 3/4\"","M",{"$f":"OFFSET(PLQ!$E$12,ROW($P41)-ROW(P$12),0)","v":10.7},88.26,"BDI 1",111.67,1194.8699999999999,"",{"$f":"IF(OR($A41=0,$A41=\"S\",$A41>CFF!$A$9),\"\",MAX(V$12:OFFSET(V41,-1,0))+1)","v":""},"SINAPI-84863",7391,{"$f":"IF(Import.Desoneracao=\"sim\",Referencia.Desonerado,Referencia.NaoDesonerado)","v":103.83},{"$f":"ROUND(IF(ISNUMBER(R41),R41,IF(LEFT(R41,3)=\"BDI\",HLOOKUP(R41,DADOS!$T$37:$X$38,2,FALSE),0)),15-11*$X$5)","v":0.26519999999999999}]
["S",0,1,8,0,0,5,0,0,"Serviço","1.8.5.","SINAPI","74072/1","CORRIMAO EM TUBO ACO GALVANIZADO 3/4\" COM BRACADEIRA","M",{"$f":"OFFSET(PLQ!$E$12,ROW($P42)-ROW(P$12),0)","v":13.56},54.08,"BDI 1",68.42,927.78,"",{"$f":"IF(OR($A42=0,$A42=\"S\",$A42>CFF!$A$9),\"\",MAX(V$12:OFFSET(V42,-1,0))+1)","v":""},"SINAPI-74072/1",7386,{"$f":"IF(Import.Desoneracao=\"sim\",Referencia.Desonerado,Referencia.NaoDesonerado)","v":63.62},{"$f":"ROUND(IF(ISNUMBER(R42),R42,IF(LEFT(R42,3)=\"BDI\",HLOOKUP(R42,DADOS!$T$37:$X$38,2,FALSE),0)),15-11*$X$5)","v":0.26519999999999999}]
["S",0,1,8,0,0,6,0,0,"Serviço","1.8.6.","SINAPI","93182","VERGA PRÉ-MOLDADA ","M",{"$f":"OFFSET(PLQ!$E$12,ROW($P43)-ROW(P$12),0)","v":139.5},19.239999999999998,"BDI 1",24.34,3395.43,"",{"$f":"IF(OR($A43=0,$A43=\"S\",$A43>CFF!$A$9),\"\",MAX(V$12:OFFSET(V43,-1,0))+1)","v":""},"SINAPI-93182",7985,{"$f":"IF(Import.Desoneracao=\"sim\",Referencia.Desonerado,Referencia.NaoDesonerado)","v":22.64},{"$f":"ROUND(IF(ISNUMBER(R43),R43,IF(LEFT(R43,3)=\"BDI\",HLOOKUP(R43,DADOS!$T$37:$X$38,2,FALSE),0)),15-11*$X$5)","v":0.26519999999999999}]
["S",0,1,8,0,0,7,0,0,"Serviço","1.8.7.","SINAPI","93195","CONTRAVERGA PRÉ-MOLDADA ","M",{"$f":"OFFSET(PLQ!$E$12,ROW($P44)-ROW(P$12),0)","v":106.1},22.54,"BDI 1",28.52,3025.97,"",{"$f":"IF(OR($A44=0,$A44=\"S\",$A44>CFF!$A$9),\"\",MAX(V$12:OFFSET(V44,-1,0))+1)","v":""},"SINAPI-93195",7998,{"$f":"IF(Import.Desoneracao=\"sim\",Referencia.Desonerado,Referencia.NaoDesonerado)","v":26.52},{"$f":"ROUND(IF(ISNUMBER(R44),R44,IF(LEFT(R44,3)=\"BDI\",HLOOKUP(R44,DADOS!$T$37:$X$38,2,FALSE),0)),15-11*$X$5)","v":0.26519999999999999}]
[2,5,1,9,0,0,0,{"$f":"IF(OR($A45=\"S\",$A45=0),0,MATCH(0,OFFSET($B45,1,$A45,ROW($A$167)-ROW($A45)),0))","v":122},{"$f":"IF(OR($A45=\"S\",$A45=0),0,MATCH(OFFSET($B45,0,$A45)+1,OFFSET($B45,1,$A45,ROW($A$167)-ROW($A45)),0))","v":5},"Nível 2","1.9.",null,null,"REVESTIMENTOS",{"$f":"Referencia.Unidade","v":""},{"$f":"OFFSET(PLQ!$E$12,ROW($P45)-ROW(P$12),0)","v":0},null,"BDI 1",{"$f":"IF($A45=\"S\",IF($Q$10=\"Preço Unitário (R$)\",PO.CustoUnitario,ROUND(PO.CustoUnitario*(1+$Z45),15-13*$X$6)),0)","v":0},{"$f":"IF($A45=\"S\",VTOTAL1,IF($A45=0,0,ROUND(SomaAgrup,15-13*$X$7)))","v":80876.86},"",{"$f":"IF(OR($A45=0,$A45=\"S\",$A45>CFF!$A$9),\"\",MAX(V$12:OFFSET(V45,-1,0))+1)","v":10},false,{"$f":"IF(AND(Fonte<>\"\",Código<>\"\"),MATCH(Fonte&\" \"&IF(Fonte=\"sinapi\",SUBSTITUTE(SUBSTITUTE(Código,\"/00\",\"/\"),\"/0\",\"/\"),Código),INDIRECT(\"'[Referência \"&_xlnm.Database&\".xls]Banco'!$a:$a\"),0),\"X\")","v":"X"},{"$f":"IF(Import.Desoneracao=\"sim\",Referencia.Desonerado,Referencia.NaoDesonerado)","v":0},{"$f":"ROUND(IF(ISNUMBER(R45),R45,IF(LEFT(R45,3)=\"BDI\",HLOOKUP(R45,DADOS!$T$37:$X$38,2,FALSE),0)),15-11*$X$5)","v":0.26519999999999999}]
["S",0,1,9,0,0,1,0,0,"Serviço","1.9.1.","SINAPI",87879,"CHAPISCO APLICADO EM ALVENARIAS E ESTRUTURAS DE CONCRETO, ARGAMASSA TRAÇO 1:3 ","M2",{"$f":"OFFSET(PLQ!$E$12,ROW($P46)-ROW(P$12),0)","v":2393.23},2.52,"BDI 1",3.19,7634.4,"",{"$f":"IF(OR($A46=0,$A46=\"S\",$A46>CFF!$A$9),\"\",MAX(V$12:OFFSET(V46,-1,0))+1)","v":""},"SINAPI-87879",11075,{"$f":"IF(Import.Desoneracao=\"sim\",Referencia.Desonerado,Referencia.NaoDesonerado)","v":2.97},{"$f":"ROUND(IF(ISNUMBER(R46),R46,IF(LEFT(R46,3)=\"BDI\",HLOOKUP(R46,DADOS!$T$37:$X$38,2,FALSE),0)),15-11*$X$5)","v":0.26519999999999999}]
["S",0,1,9,0,0,2,0,0,"Serviço","1.9.2.","SINAPI",87535,"EMBOÇO, PARA RECEBIMENTO DE CERÂMICA, EM ARGAMASSA TRAÇO 1:2:8, ESPESSURA DE 20MM, COM EXECUÇÃO DE TALISCAS","M2",{"$f":"OFFSET(PLQ!$E$12,ROW($P47)-ROW(P$12),0)","v":2393.23},17.36,"BDI 1",21.96,52555.33,"",{"$f":"IF(OR($A47=0,$A47=\"S\",$A47>CFF!$A$9),\"\",MAX(V$12:OFFSET(V47,-1,0))+1)","v":""},"SINAPI-87535",11143,{"$f":"IF(Import.Desoneracao=\"sim\",Referencia.Desonerado,Referencia.NaoDesonerado)","v":20.420000000000002},{"$f":"ROUND(IF(ISNUMBER(R47),R47,IF(LEFT(R47,3)=\"BDI\",HLOOKUP(R47,DADOS!$T$37:$X$38,2,FALSE),0)),15-11*$X$5)","v":0.26519999999999999}]
["S",0,1,9,0,0,3,0,0,"Serviço","1.9.3.","SINAPI","87273","REVESTIMENTO CERÂMICO PARA PAREDES INTERNAS COM PLACAS TIPO ESMALTADA EXTRA DE DIMENSÕES 33X45 CM ATÉ 2,10m ","M2",{"$f":"OFFSET(PLQ!$E$12,ROW($P48)-ROW(P$12),0)","v":165.2},42.04,"BDI 1",53.19,8786.99,"",{"$f":"IF(OR($A48=0,$A48=\"S\",$A48>CFF!$A$9),\"\",MAX(V$12:OFFSET(V48,-1,0))+1)","v":""},"SINAPI-87273",11253,{"$f":"IF(Import.Desoneracao=\"sim\",Referencia.Desonerado,Referencia.NaoDesonerado)","v":49.46},{"$f":"ROUND(IF(ISNUMBER(R48),R48,IF(LEFT(R48,3)=\"BDI\",HLOOKUP(R48,DADOS!$T$37:$X$38,2,FALSE),0)),15-11*$X$5)","v":0.26519999999999999}]
["S",0,1,9,0,0,4,0,0,"Serviço","1.9.4.","REVESTIMENTO","TIJOLETAS","REVESTIMENTO CERÂMICO EM TIJOLETAS LISAS 10x20x2,5CM, ASSENTADAS COM ARGAMASSA DO TIPO ACIII","M²",{"$f":"OFFSET(PLQ!$E$12,ROW($P49)-ROW(P$12),0)","v":120.52},78.040000000000006,"BDI 1",98.74,11900.14,"",{"$f":"IF(OR($A49=0,$A49=\"S\",$A49>CFF!$A$9),\"\",MAX(V$12:OFFSET(V49,-1,0))+1)","v":""},"REVESTIMENTO-TIJOLETAS",52,{"$f":"IF(Import.Desoneracao=\"sim\",Referencia.Desonerado,Referencia.NaoDesonerado)","v":91.81},{"$f":"ROUND(IF(ISNUMBER(R49),R49,IF(LEFT(R49,3)=\"BDI\",HLOOKUP(R49,DADOS!$T$37:$X$38,2,FALSE),0)),15-11*$X$5)","v":0.26519999999999999}]
[2,8,1,10,0,0,0,117,8,"Nível 2","1.10.",null,null,"COBERTURAS",{"$f":"Referencia.Unidade","v":""},{"$f":"OFFSET(PLQ!$E$12,ROW($P50)-ROW(P$12),0)","v":0},null,"BDI 1",0,37144.82,"",{"$f":"IF(OR($A50=0,$A50=\"S\",$A50>CFF!$A$9),\"\",MAX(V$12:OFFSET(V50,-1,0))+1)","v":11},false,"X",{"$f":"IF(Import.Desoneracao=\"sim\",Referencia.Desonerado,Referencia.NaoDesonerado)","v":0},{"$f":"ROUND(IF(ISNUMBER(R50),R50,IF(LEFT(R50,3)=\"BDI\",HLOOKUP(R50,DADOS!$T$37:$X$38,2,FALSE),0)),15-11*$X$5)","v":0.26519999999999999}]
["S",0,1,10,0,0,1,0,0,"Serviço","1.10.1.","SINAPI","94207","TELHAMENTO COM TELHA ONDULADA DE FIBROCIMENTO E = 6 MM, COM RECOBRIMENTO LATERAL DE 1/4 DE ONDA, INCLUSO IÇAMENTO","M2",{"$f":"OFFSET(PLQ!$E$12,ROW($P51)-ROW(P$12),0)","v":285.57},25.67,"BDI 1",32.479999999999997,9275.31,"",{"$f":"IF(OR($A51=0,$A51=\"S\",$A51>CFF!$A$9),\"\",MAX(V$12:OFFSET(V51,-1,0))+1)","v":""},"SINAPI-94207",6904,{"$f":"IF(Import.Desoneracao=\"sim\",Referencia.Desonerado,Referencia.NaoDesonerado)","v":30.2},{"$f":"ROUND(IF(ISNUMBER(R51),R51,IF(LEFT(R51,3)=\"BDI\",HLOOKUP(R51,DADOS!$T$37:$X$38,2,FALSE),0)),15-11*$X$5)","v":0.26519999999999999}]
["S",0,1,10,0,0,2,0,0,"Serviço","1.10.2.","SINAPI","94223","CUMEEIRA PARA TELHA DE FIBROCIMENTO ONDULADA E = 6 MM, INCLUSO ACESSÓRIOS DE FIXAÇÃO E IÇAMENTO","M",{"$f":"OFFSET(PLQ!$E$12,ROW($P52)-ROW(P$12),0)","v":34.83},33.07,"BDI 1",41.84,1457.29,"",{"$f":"IF(OR($A52=0,$A52=\"S\",$A52>CFF!$A$9),\"\",MAX(V$12:OFFSET(V52,-1,0))+1)","v":""},"SINAPI-94223",6925,{"$f":"IF(Import.Desoneracao=\"sim\",Referencia.Desonerado,Referencia.NaoDesonerado)","v":38.909999999999997},{"$f":"ROUND(IF(ISNUMBER(R52),R52,IF(LEFT(R52,3)=\"BDI\",HLOOKUP(R52,DADOS!$T$37:$X$38,2,FALSE),0)),15-11*$X$5)","v":0.26519999999999999}]
["S",0,1,10,0,0,3,0,0,"Serviço","1.10.3.","SINAPI","94228","CALHA EM CHAPA DE AÇO GALVANIZADO NÚMERO 24, DESENVOLVIMENTO DE 50 CM, INCLUSO TRANSPORTE VERTICAL","M",{"$f":"OFFSET(PLQ!$E$12,ROW($P53)-ROW(P$12),0)","v":73.55},43.76,"BDI 1",55.37,4072.46,"",{"$f":"IF(OR($A53=0,$A53=\"S\",$A53>CFF!$A$9),\"\",MAX(V$12:OFFSET(V53,-1,0))+1)","v":""},"SINAPI-94228",6929,{"$f":"IF(Import.Desoneracao=\"sim\",Referencia.Desonerado,Referencia.NaoDesonerado)","v":51.48},{"$f":"ROUND(IF(ISNUMBER(R53),R53,IF(LEFT(R53,3)=\"BDI\",HLOOKUP(R53,DADOS!$T$37:$X$38,2,FALSE),0)),15-11*$X$5)","v":0.26519999999999999}]
["S",0,1,10,0,0,4,0,0,"Serviço","1.10.4.","SINAPI","92544","TRAMA DE MADEIRA COMPOSTA POR TERÇAS PARA TELHADOS TELHA DE FIBROCIMENTO, INCLUSO TRANSPORTE VERTICAL","M2",{"$f":"OFFSET(PLQ!$E$12,ROW($P54)-ROW(P$12),0)","v":285.57},11.25,"BDI 1",14.23,4063.66,"",{"$f":"IF(OR($A54=0,$A54=\"S\",$A54>CFF!$A$9),\"\",MAX(V$12:OFFSET(V54,-1,0))+1)","v":""},"SINAPI-92544",6860,{"$f":"IF(Import.Desoneracao=\"sim\",Referencia.Desonerado,Referencia.NaoDesonerado)","v":13.24},{"$f":"ROUND(IF(ISNUMBER(R54),R54,IF(LEFT(R54,3)=\"BDI\",HLOOKUP(R54,DADOS!$T$37:$X$38,2,FALSE),0)),15-11*$X$5)","v":0.26519999999999999}]
["S",0,1,10,0,0,5,0,0,"Serviço","1.10.5.","SINAPI","94231","PINGADEIRAS EM CHAPA DE AÇO GALVANIZADO NÚMERO 24, CORTE DE 25 CM, INCLUSO TRANSPORTE VERTICAL","M",{"$f":"OFFSET(PLQ!$E$12,ROW($P55)-ROW(P$12),0)","v":121.7},22.64,"BDI 1",28.64,3485.49,"",{"$f":"IF(OR($A55=0,$A55=\"S\",$A55>CFF!$A$9),\"\",MAX(V$12:OFFSET(V55,-1,0))+1)","v":""},"SINAPI-94231",6931,{"$f":"IF(Import.Desoneracao=\"sim\",Referencia.Desonerado,Referencia.NaoDesonerado)","v":26.64},{"$f":"ROUND(IF(ISNUMBER(R55),R55,IF(LEFT(R55,3)=\"BDI\",HLOOKUP(R55,DADOS!$T$37:$X$38,2,FALSE),0)),15-11*$X$5)","v":0.26519999999999999}]
["S",0,1,10,0,0,6,0,0,"Serviço","1.10.6.","SINAPI","73665","ESCADA TIPO MARINHEIRO EM ACO CA-50 9,52MM INCLUSO PINTURA COM FUNDO ANTICORROSIVO TIPO ZARCAO","M",{"$f":"OFFSET(PLQ!$E$12,ROW($P56)-ROW(P$12),0)","v":4.2},50.53,"BDI 1",63.93,268.51,"",{"$f":"IF(OR($A56=0,$A56=\"S\",$A56>CFF!$A$9),\"\",MAX(V$12:OFFSET(V56,-1,0))+1)","v":""},"SINAPI-73665",7384,{"$f":"IF(Import.Desoneracao=\"sim\",Referencia.Desonerado,Referencia.NaoDesonerado)","v":59.45},{"$f":"ROUND(IF(ISNUMBER(R56),R56,IF(LEFT(R56,3)=\"BDI\",HLOOKUP(R56,DADOS!$T$37:$X$38,2,FALSE),0)),15-11*$X$5)","v":0.26519999999999999}]
["S",0,1,10,0,0,7,0,0,"Serviço","1.10.7.","SINAPI","96113","FORRO EM PLACAS DE GESSO","M2",{"$f":"OFFSET(PLQ!$E$12,ROW($P57)-ROW(P$12),0)","v":425.12},27,"BDI 1",34.159999999999997,14522.1,"",{"$f":"IF(OR($A57=0,$A57=\"S\",$A57>CFF!$A$9),\"\",MAX(V$12:OFFSET(V57,-1,0))+1)","v":""},"SINAPI-96113",11275,{"$f":"IF(Import.Desoneracao=\"sim\",Referencia.Desonerado,Referencia.NaoDesonerado)","v":31.76},{"$f":"ROUND(IF(ISNUMBER(R57),R57,IF(LEFT(R57,3)=\"BDI\",HLOOKUP(R57,DADOS!$T$37:$X$38,2,FALSE),0)),15-11*$X$5)","v":0.26519999999999999}]
[2,10,1,11,0,0,0,109,10,"Nível 2","1.11.",null,null,"ESQUADRIAS",{"$f":"Referencia.Unidade","v":""},{"$f":"OFFSET(PLQ!$E$12,ROW($P58)-ROW(P$12),0)","v":0},0,"BDI 1",0,135475.68,"",{"$f":"IF(OR($A58=0,$A58=\"S\",$A58>CFF!$A$9),\"\",MAX(V$12:OFFSET(V58,-1,0))+1)","v":12},false,"X",{"$f":"IF(Import.Desoneracao=\"sim\",Referencia.Desonerado,Referencia.NaoDesonerado)","v":0},{"$f":"ROUND(IF(ISNUMBER(R58),R58,IF(LEFT(R58,3)=\"BDI\",HLOOKUP(R58,DADOS!$T$37:$X$38,2,FALSE),0)),15-11*$X$5)","v":0.26519999999999999}]
["S",0,1,11,0,0,1,0,0,"Serviço","1.11.1.","SINAPI","90844","PORTA DE MADEIRA PARA PINTURA, SEMI-OCA (LEVE OU MÉDIA), PADRÃO MÉDIO, 90X210CM, ESPESSURA DE 3,5CM, ITENS INCLUSOS: DOBRADIÇAS, MONTAGEM E INSTALAÇÃO DO BATENTE, FECHADURA COM EXECUÇÃO DO FURO - FORNECIMENTO E INSTALAÇÃO","UN",{"$f":"OFFSET(PLQ!$E$12,ROW($P59)-ROW(P$12),0)","v":12},550,"BDI 1",695.86,8350.32,"",{"$f":"IF(OR($A59=0,$A59=\"S\",$A59>CFF!$A$9),\"\",MAX(V$12:OFFSET(V59,-1,0))+1)","v":""},"SINAPI-90844",7301,{"$f":"IF(Import.Desoneracao=\"sim\",Referencia.Desonerado,Referencia.NaoDesonerado)","v":687.1},{"$f":"ROUND(IF(ISNUMBER(R59),R59,IF(LEFT(R59,3)=\"BDI\",HLOOKUP(R59,DADOS!$T$37:$X$38,2,FALSE),0)),15-11*$X$5)","v":0.26519999999999999}]
["S",0,1,11,0,0,2,0,0,"Serviço","1.11.2.","PORTA","2","PORTA EM VIDRO TEMPERADO FUME E=10mm, COM PERFIL DE ALUMINIO, CORES VARIADAS, DE GIRAR 2,40 X 2,10M","UNID",{"$f":"OFFSET(PLQ!$E$12,ROW($P60)-ROW(P$12),0)","v":2},2518.5300000000002,"BDI 1",3186.44,6372.88,"",{"$f":"IF(OR($A60=0,$A60=\"S\",$A60>CFF!$A$9),\"\",MAX(V$12:OFFSET(V60,-1,0))+1)","v":""},"PORTA-2",51,{"$f":"IF(Import.Desoneracao=\"sim\",Referencia.Desonerado,Referencia.NaoDesonerado)","v":2962.9800000000005},{"$f":"ROUND(IF(ISNUMBER(R60),R60,IF(LEFT(R60,3)=\"BDI\",HLOOKUP(R60,DADOS!$T$37:$X$38,2,FALSE),0)),15-11*$X$5)","v":0.26519999999999999}]
["S",0,1,11,0,0,3,0,0,"Serviço","1.11.3.","SINAPI","84876","PORTA MADEIRA 1A CORRER P/VIDRO 30MM/ GUARNICAO 15CM/ALIZAR","M2",{"$f":"OFFSET(PLQ!$E$12,ROW($P61)-ROW(P$12),0)","v":8.4},525.15,"BDI 1",664.42,5581.13,"",{"$f":"IF(OR($A61=0,$A61=\"S\",$A61>CFF!$A$9),\"\",MAX(V$12:OFFSET(V61,-1,0))+1)","v":""},"SINAPI-84876",7275,{"$f":"IF(Import.Desoneracao=\"sim\",Referencia.Desonerado,Referencia.NaoDesonerado)","v":617.82000000000005},{"$f":"ROUND(IF(ISNUMBER(R61),R61,IF(LEFT(R61,3)=\"BDI\",HLOOKUP(R61,DADOS!$T$37:$X$38,2,FALSE),0)),15-11*$X$5)","v":0.26519999999999999}]
[{"$f":"CHOOSE(1+LOG(1+2*(J62=\"Meta\")+4*(J62=\"Nível 2\")+8*(J62=\"Nível 3\")+16*(J62=\"Nível 4\")+32*(J62=\"Serviço\"),2),0,1,2,3,4,\"S\")","v":"S"},{"$f":"IF(OR(A62=\"S\",A62=0),0,IF(ISERROR(I62),H62,SMALL(H62:I62,1)))","v":0},{"$f":"IF($A62=1,OFFSET(C62,-1,0)+1,OFFSET(C62,-1,0))","v":1},{"$f":"IF($A62=1,0,IF($A62=2,OFFSET(D62,-1,0)+1,OFFSET(D62,-1,0)))","v":11},{"$f":"IF(AND($A62<=2,$A62<>0),0,IF($A62=3,OFFSET(E62,-1,0)+1,OFFSET(E62,-1,0)))","v":0},{"$f":"IF(AND($A62<=3,$A62<>0),0,IF($A62=4,OFFSET(F62,-1,0)+1,OFFSET(F62,-1,0)))","v":0},{"$f":"IF(AND($A62<=4,$A62<>0),0,IF($A62=\"S\",OFFSET(G62,-1,0)+1,OFFSET(G62,-1,0)))","v":4},0,0,"Serviço",{"$f":"IF($A62=0,\"-\",CONCATENATE(C62&\".\",IF(AND($A$5>=2,$A62>=2),D62&\".\",\"\"),IF(AND($A$5>=3,$A62>=3),E62&\".\",\"\"),IF(AND($A$5>=4,$A62>=4),F62&\".\",\"\"),IF($A62=\"S\",G62&\".\",\"\")))","v":"1.11.4."},"PORTA","1","PORTA EM VIDRO TEMPERADO FUME E=10mm, COM PERFIL DE ALUMINIO, CORES VARIADAS, DE GIRAR  2,40 X 3,00M","UNID",{"$f":"OFFSET(PLQ!$E$12,ROW($P62)-ROW(P$12),0)","v":1},3159.61,"BDI 1",{"$f":"IF($A62=\"S\",IF($Q$10=\"Preço Unitário (R$)\",PO.CustoUnitario,ROUND(PO.CustoUnitario*(1+$Z62),15-13*$X$6)),0)","v":3997.54},{"$f":"IF($A62=\"S\",VTOTAL1,IF($A62=0,0,ROUND(SomaAgrup,15-13*$X$7)))","v":3997.54},{"$f":"IF($J62=\"\",\"\",IF($N62=\"\",\"DESCRIÇÃO\",IF(AND($J62=\"Serviço\",$O62=\"\"),\"UNIDADE\",IF($T62<=0,\"SEM VALOR\",IF(AND($Y62<>\"\",$Q62>$Y62),\"ACIMA REF.\",\"\")))))","v":""},{"$f":"IF(OR($A62=0,$A62=\"S\",$A62>CFF!$A$9),\"\",MAX(V$12:OFFSET(V62,-1,0))+1)","v":""},{"$f":"IF(AND($J62=\"Serviço\",$M62<>\"\"),IF($L62=\"\",$M62,CONCATENATE($L62,\"-\",$M62)))","v":"PORTA-1"},{"$f":"IF(AND(Fonte<>\"\",Código<>\"\"),MATCH(Fonte&\" \"&IF(Fonte=\"sinapi\",SUBSTITUTE(SUBSTITUTE(Código,\"/00\",\"/\"),\"/0\",\"/\"),Código),INDIRECT(\"'[Referência \"&_xlnm.Database&\".xls]Banco'!$a:$a\"),0),\"X\")","v":50},{"$f":"IF(Import.Desoneracao=\"sim\",Referencia.Desonerado,Referencia.NaoDesonerado)","v":3717.19},{"$f":"ROUND(IF(ISNUMBER(R62),R62,IF(LEFT(R62,3)=\"BDI\",HLOOKUP(R62,DADOS!$T$37:$X$38,2,FALSE),0)),15-11*$X$5)","v":0.26519999999999999}]
["S",0,1,11,0,0,5,0,0,"Serviço","1.11.5.","SINAPI-I","4917","PORTA DE ABRIR EM ALUMINIO TIPO VENEZIANA, ACABAMENTO ANODIZADO NATURAL, SEM GUARNICAO/ALIZAR/VISTA","M2",{"$f":"OFFSET(PLQ!$E$12,ROW($P63)-ROW(P$12),0)","v":9.6},550,"BDI 1",695.86,6680.26,"",{"$f":"IF(OR($A63=0,$A63=\"S\",$A63>CFF!$A$9),\"\",MAX(V$12:OFFSET(V63,-1,0))+1)","v":""},"SINAPI-I-4917",4116,{"$f":"IF(Import.Desoneracao=\"sim\",Referencia.Desonerado,Referencia.NaoDesonerado)","v":637.01},{"$f":"ROUND(IF(ISNUMBER(R63),R63,IF(LEFT(R63,3)=\"BDI\",HLOOKUP(R63,DADOS!$T$37:$X$38,2,FALSE),0)),15-11*$X$5)","v":0.26519999999999999}]
["S",0,1,11,0,0,6,0,0,"Serviço","1.11.6.","SINAPI","94581","JANELA DE ALUMÍNIO MAXIM-AR, FIXAÇÃO COM ARGAMASSA, COM VIDROS, PADRONIZADA","M2",{"$f":"OFFSET(PLQ!$E$12,ROW($P64)-ROW(P$12),0)","v":151.4},500,"BDI 1",632.6,95775.64,"",{"$f":"IF(OR($A64=0,$A64=\"S\",$A64>CFF!$A$9),\"\",MAX(V$12:OFFSET(V64,-1,0))+1)","v":""},"SINAPI-94581",7446,{"$f":"IF(Import.Desoneracao=\"sim\",Referencia.Desonerado,Referencia.NaoDesonerado)","v":655.32000000000005},{"$f":"ROUND(IF(ISNUMBER(R64),R64,IF(LEFT(R64,3)=\"BDI\",HLOOKUP(R64,DADOS!$T$37:$X$38,2,FALSE),0)),15-11*$X$5)","v":0.26519999999999999}]
[{"$f":"CHOOSE(1+LOG(1+2*(J65=\"Meta\")+4*(J65=\"Nível 2\")+8*(J65=\"Nível 3\")+16*(J65=\"Nível 4\")+32*(J65=\"Serviço\"),2),0,1,2,3,4,\"S\")","v":"S"},{"$f":"IF(OR(A65=\"S\",A65=0),0,IF(ISERROR(I65),H65,SMALL(H65:I65,1)))","v":0},{"$f":"IF($A65=1,OFFSET(C65,-1,0)+1,OFFSET(C65,-1,0))","v":1},{"$f":"IF($A65=1,0,IF($A65=2,OFFSET(D65,-1,0)+1,OFFSET(D65,-1,0)))","v":11},{"$f":"IF(AND($A65<=2,$A65<>0),0,IF($A65=3,OFFSET(E65,-1,0)+1,OFFSET(E65,-1,0)))","v":0},{"$f":"IF(AND($A65<=3,$A65<>0),0,IF($A65=4,OFFSET(F65,-1,0)+1,OFFSET(F65,-1,0)))","v":0},{"$f":"IF(AND($A65<=4,$A65<>0),0,IF($A65=\"S\",OFFSET(G65,-1,0)+1,OFFSET(G65,-1,0)))","v":7},0,0,"Serviço",{"$f":"IF($A65=0,\"-\",CONCATENATE(C65&\".\",IF(AND($A$5>=2,$A65>=2),D65&\".\",\"\"),IF(AND($A$5>=3,$A65>=3),E65&\".\",\"\"),IF(AND($A$5>=4,$A65>=4),F65&\".\",\"\"),IF($A65=\"S\",G65&\".\",\"\")))","v":"1.11.7."},"SINAPI-I","599","JANELA FIXA EM ALUMINIO, 60  X 80 CM (A X L), BATENTE/REQUADRO DE 3 A 14 CM, COM VIDRO","M2",{"$f":"OFFSET(PLQ!$E$12,ROW($P65)-ROW(P$12),0)","v":4.5},350.07,"BDI 1",{"$f":"IF($A65=\"S\",IF($Q$10=\"Preço Unitário (R$)\",PO.CustoUnitario,ROUND(PO.CustoUnitario*(1+$Z65),15-13*$X$6)),0)","v":442.91},{"$f":"IF($A65=\"S\",VTOTAL1,IF($A65=0,0,ROUND(SomaAgrup,15-13*$X$7)))","v":1993.1},{"$f":"IF($J65=\"\",\"\",IF($N65=\"\",\"DESCRIÇÃO\",IF(AND($J65=\"Serviço\",$O65=\"\"),\"UNIDADE\",IF($T65<=0,\"SEM VALOR\",IF(AND($Y65<>\"\",$Q65>$Y65),\"ACIMA REF.\",\"\")))))","v":""},{"$f":"IF(OR($A65=0,$A65=\"S\",$A65>CFF!$A$9),\"\",MAX(V$12:OFFSET(V65,-1,0))+1)","v":""},{"$f":"IF(AND($J65=\"Serviço\",$M65<>\"\"),IF($L65=\"\",$M65,CONCATENATE($L65,\"-\",$M65)))","v":"SINAPI-I-599"},{"$f":"IF(AND(Fonte<>\"\",Código<>\"\"),MATCH(Fonte&\" \"&IF(Fonte=\"sinapi\",SUBSTITUTE(SUBSTITUTE(Código,\"/00\",\"/\"),\"/0\",\"/\"),Código),INDIRECT(\"'[Referência \"&_xlnm.Database&\".xls]Banco'!$a:$a\"),0),\"X\")","v":2852},{"$f":"IF(Import.Desoneracao=\"sim\",Referencia.Desonerado,Referencia.NaoDesonerado)","v":411.85},{"$f":"ROUND(IF(ISNUMBER(R65),R65,IF(LEFT(R65,3)=\"BDI\",HLOOKUP(R65,DADOS!$T$37:$X$38,2,FALSE),0)),15-11*$X$5)","v":0.26519999999999999}]
["S",0,1,11,0,0,8,0,0,"Serviço","1.11.8.","SINAPI-I","4828","SOLEIRA EM MARMORE, POLIDO, L= *15* CM, E=  *2* CM,  CORTE RETO","M",{"$f":"OFFSET(PLQ!$E$12,ROW($P66)-ROW(P$12),0)","v":22},45.31,"BDI 1",57.33,1261.26,"",{"$f":"IF(OR($A66=0,$A66=\"S\",$A66>CFF!$A$9),\"\",MAX(V$12:OFFSET(V66,-1,0))+1)","v":""},"SINAPI-I-4828",4524,{"$f":"IF(Import.Desoneracao=\"sim\",Referencia.Desonerado,Referencia.NaoDesonerado)","v":53.3},{"$f":"ROUND(IF(ISNUMBER(R66),R66,IF(LEFT(R66,3)=\"BDI\",HLOOKUP(R66,DADOS!$T$37:$X$38,2,FALSE),0)),15-11*$X$5)","v":0.26519999999999999}]
["S",0,1,11,0,0,9,0,0,"Serviço","1.11.9.","SINAPI-I","4828","PEITORIL EM MARMORE, POLIDO, L= *15* CM, E=  *2* CM,  CORTE RETO","M",{"$f":"OFFSET(PLQ!$E$12,ROW($P67)-ROW(P$12),0)","v":95.3},45.31,"BDI 1",57.33,5463.55,"",{"$f":"IF(OR($A67=0,$A67=\"S\",$A67>CFF!$A$9),\"\",MAX(V$12:OFFSET(V67,-1,0))+1)","v":""},"SINAPI-I-4828",4524,{"$f":"IF(Import.Desoneracao=\"sim\",Referencia.Desonerado,Referencia.NaoDesonerado)","v":53.3},{"$f":"ROUND(IF(ISNUMBER(R67),R67,IF(LEFT(R67,3)=\"BDI\",HLOOKUP(R67,DADOS!$T$37:$X$38,2,FALSE),0)),15-11*$X$5)","v":0.26519999999999999}]
[2,6,1,12,0,0,0,99,6,"Nível 2","1.12.",null,null,"PAVIMENTAÇÕES",{"$f":"Referencia.Unidade","v":""},{"$f":"OFFSET(PLQ!$E$12,ROW($P68)-ROW(P$12),0)","v":0},0,"BDI 1",0,75043.759999999995,"",{"$f":"IF(OR($A68=0,$A68=\"S\",$A68>CFF!$A$9),\"\",MAX(V$12:OFFSET(V68,-1,0))+1)","v":13},false,"X",{"$f":"IF(Import.Desoneracao=\"sim\",Referencia.Desonerado,Referencia.NaoDesonerado)","v":0},{"$f":"ROUND(IF(ISNUMBER(R68),R68,IF(LEFT(R68,3)=\"BDI\",HLOOKUP(R68,DADOS!$T$37:$X$38,2,FALSE),0)),15-11*$X$5)","v":0.26519999999999999}]
["S",0,1,12,0,0,1,0,0,"Serviço","1.12.1.","SINAPI-I","4718","PEDRA BRITADA N. 2 PARA LASTRO","M3",{"$f":"OFFSET(PLQ!$E$12,ROW($P69)-ROW(P$12),0)","v":19.940000000000001},51,"BDI 1",64.53,1286.73,"",{"$f":"IF(OR($A69=0,$A69=\"S\",$A69>CFF!$A$9),\"\",MAX(V$12:OFFSET(V69,-1,0))+1)","v":""},"SINAPI-I-4718",3906,{"$f":"IF(Import.Desoneracao=\"sim\",Referencia.Desonerado,Referencia.NaoDesonerado)","v":60},{"$f":"ROUND(IF(ISNUMBER(R69),R69,IF(LEFT(R69,3)=\"BDI\",HLOOKUP(R69,DADOS!$T$37:$X$38,2,FALSE),0)),15-11*$X$5)","v":0.26519999999999999}]
["S",0,1,12,0,0,2,0,0,"Serviço","1.12.2.","SINAPI",68325,"PISO EM CONCRETO 20 MPA PREPARO MECANICO, ESPESSURA 7CM, INCLUSO SELANTE ELASTICO A BASE DE POLIURETANO","M2",{"$f":"OFFSET(PLQ!$E$12,ROW($P70)-ROW(P$12),0)","v":398.89},35.119999999999997,"BDI 1",44.43,17722.68,"",{"$f":"IF(OR($A70=0,$A70=\"S\",$A70>CFF!$A$9),\"\",MAX(V$12:OFFSET(V70,-1,0))+1)","v":""},"SINAPI-68325",10978,{"$f":"IF(Import.Desoneracao=\"sim\",Referencia.Desonerado,Referencia.NaoDesonerado)","v":41.32},{"$f":"ROUND(IF(ISNUMBER(R70),R70,IF(LEFT(R70,3)=\"BDI\",HLOOKUP(R70,DADOS!$T$37:$X$38,2,FALSE),0)),15-11*$X$5)","v":0.26519999999999999}]
["S",0,1,12,0,0,3,0,0,"Serviço","1.12.3.","SINAPI",87630,"CONTRAPISO EM ARGAMASSA TRAÇO 1:4 (CIMENTO E AREIA), ADERIDO, ESPESSURA 3CM","M2",{"$f":"OFFSET(PLQ!$E$12,ROW($P71)-ROW(P$12),0)","v":580.91999999999996},25.61,"BDI 1",32.4,18821.810000000001,"",{"$f":"IF(OR($A71=0,$A71=\"S\",$A71>CFF!$A$9),\"\",MAX(V$12:OFFSET(V71,-1,0))+1)","v":""},"SINAPI-87630",10997,{"$f":"IF(Import.Desoneracao=\"sim\",Referencia.Desonerado,Referencia.NaoDesonerado)","v":30.13},{"$f":"ROUND(IF(ISNUMBER(R71),R71,IF(LEFT(R71,3)=\"BDI\",HLOOKUP(R71,DADOS!$T$37:$X$38,2,FALSE),0)),15-11*$X$5)","v":0.26519999999999999}]
["S",0,1,12,0,0,4,0,0,"Serviço","1.12.4.","SINAPI","87257","REVESTIMENTO CERÂMICO PARA PISO COM PLACAS TIPO ESMALTADA EXTRA DE DIMENSÕES 60X60 CM ","M2",{"$f":"OFFSET(PLQ!$E$12,ROW($P72)-ROW(P$12),0)","v":568.20000000000005},46.36,"BDI 1",58.65,33324.93,"",{"$f":"IF(OR($A72=0,$A72=\"S\",$A72>CFF!$A$9),\"\",MAX(V$12:OFFSET(V72,-1,0))+1)","v":""},"SINAPI-87257",10931,{"$f":"IF(Import.Desoneracao=\"sim\",Referencia.Desonerado,Referencia.NaoDesonerado)","v":54.54},{"$f":"ROUND(IF(ISNUMBER(R72),R72,IF(LEFT(R72,3)=\"BDI\",HLOOKUP(R72,DADOS!$T$37:$X$38,2,FALSE),0)),15-11*$X$5)","v":0.26519999999999999}]
["S",0,1,12,0,0,5,0,0,"Serviço","1.12.5.","SINAPI","88650","RODAPÉ CERÂMICO DE 7CM DE ALTURA COM PLACAS TIPO ESMALTADA EXTRA DE DIMENSÕES 60X60CM","M",{"$f":"OFFSET(PLQ!$E$12,ROW($P73)-ROW(P$12),0)","v":362.65},8.4700000000000006,"BDI 1",10.72,3887.61,"",{"$f":"IF(OR($A73=0,$A73=\"S\",$A73>CFF!$A$9),\"\",MAX(V$12:OFFSET(V73,-1,0))+1)","v":""},"SINAPI-88650",10974,{"$f":"IF(Import.Desoneracao=\"sim\",Referencia.Desonerado,Referencia.NaoDesonerado)","v":9.9700000000000006},{"$f":"ROUND(IF(ISNUMBER(R73),R73,IF(LEFT(R73,3)=\"BDI\",HLOOKUP(R73,DADOS!$T$37:$X$38,2,FALSE),0)),15-11*$X$5)","v":0.26519999999999999}]
[2,7,1,13,0,0,0,93,7,"Nível 2","1.13.",null,null,"PINTURAS",{"$f":"Referencia.Unidade","v":""},{"$f":"OFFSET(PLQ!$E$12,ROW($P74)-ROW(P$12),0)","v":0},0,"BDI 1",0,75858.210000000006,"",{"$f":"IF(OR($A74=0,$A74=\"S\",$A74>CFF!$A$9),\"\",MAX(V$12:OFFSET(V74,-1,0))+1)","v":14},false,"X",{"$f":"IF(Import.Desoneracao=\"sim\",Referencia.Desonerado,Referencia.NaoDesonerado)","v":0},{"$f":"ROUND(IF(ISNUMBER(R74),R74,IF(LEFT(R74,3)=\"BDI\",HLOOKUP(R74,DADOS!$T$37:$X$38,2,FALSE),0)),15-11*$X$5)","v":0.26519999999999999}]
[{"$f":"CHOOSE(1+LOG(1+2*(J75=\"Meta\")+4*(J75=\"Nível 2\")+8*(J75=\"Nível 3\")+16*(J75=\"Nível 4\")+32*(J75=\"Serviço\"),2),0,1,2,3,4,\"S\")","v":"S"},{"$f":"IF(OR(A75=\"S\",A75=0),0,IF(ISERROR(I75),H75,SMALL(H75:I75,1)))","v":0},{"$f":"IF($A75=1,OFFSET(C75,-1,0)+1,OFFSET(C75,-1,0))","v":1},{"$f":"IF($A75=1,0,IF($A75=2,OFFSET(D75,-1,0)+1,OFFSET(D75,-1,0)))","v":13},{"$f":"IF(AND($A75<=2,$A75<>0),0,IF($A75=3,OFFSET(E75,-1,0)+1,OFFSET(E75,-1,0)))","v":0},{"$f":"IF(AND($A75<=3,$A75<>0),0,IF($A75=4,OFFSET(F75,-1,0)+1,OFFSET(F75,-1,0)))","v":0},{"$f":"IF(AND($A75<=4,$A75<>0),0,IF($A75=\"S\",OFFSET(G75,-1,0)+1,OFFSET(G75,-1,0)))","v":1},0,0,"Serviço",{"$f":"IF($A75=0,\"-\",CONCATENATE(C75&\".\",IF(AND($A$5>=2,$A75>=2),D75&\".\",\"\"),IF(AND($A$5>=3,$A75>=3),E75&\".\",\"\"),IF(AND($A$5>=4,$A75>=4),F75&\".\",\"\"),IF($A75=\"S\",G75&\".\",\"\")))","v":"1.13.1."},"SINAPI","96132","APLICAÇÃO MANUAL DE MASSA ACRÍLICA, DUAS DEMÃOS","M2",{"$f":"OFFSET(PLQ!$E$12,ROW($P75)-ROW(P$12),0)","v":2666.12},13.25,"BDI 1",{"$f":"IF($A75=\"S\",IF($Q$10=\"Preço Unitário (R$)\",PO.CustoUnitario,ROUND(PO.CustoUnitario*(1+$Z75),15-13*$X$6)),0)","v":16.760000000000002},{"$f":"IF($A75=\"S\",VTOTAL1,IF($A75=0,0,ROUND(SomaAgrup,15-13*$X$7)))","v":44684.17},{"$f":"IF($J75=\"\",\"\",IF($N75=\"\",\"DESCRIÇÃO\",IF(AND($J75=\"Serviço\",$O75=\"\"),\"UNIDADE\",IF($T75<=0,\"SEM VALOR\",IF(AND($Y75<>\"\",$Q75>$Y75),\"ACIMA REF.\",\"\")))))","v":""},{"$f":"IF(OR($A75=0,$A75=\"S\",$A75>CFF!$A$9),\"\",MAX(V$12:OFFSET(V75,-1,0))+1)","v":""},{"$f":"IF(AND($J75=\"Serviço\",$M75<>\"\"),IF($L75=\"\",$M75,CONCATENATE($L75,\"-\",$M75)))","v":"SINAPI-96132"},{"$f":"IF(AND(Fonte<>\"\",Código<>\"\"),MATCH(Fonte&\" \"&IF(Fonte=\"sinapi\",SUBSTITUTE(SUBSTITUTE(Código,\"/00\",\"/\"),\"/0\",\"/\"),Código),INDIRECT(\"'[Referência \"&_xlnm.Database&\".xls]Banco'!$a:$a\"),0),\"X\")","v":10866},{"$f":"IF(Import.Desoneracao=\"sim\",Referencia.Desonerado,Referencia.NaoDesonerado)","v":15.59},{"$f":"ROUND(IF(ISNUMBER(R75),R75,IF(LEFT(R75,3)=\"BDI\",HLOOKUP(R75,DADOS!$T$37:$X$38,2,FALSE),0)),15-11*$X$5)","v":0.26519999999999999}]
["S",0,1,13,0,0,2,0,0,"Serviço","1.13.2.","SINAPI","88488","APLICAÇÃO MANUAL DE PINTURA COM TINTA LÁTEX ACRÍLICA EM TETO, DUAS DEMÃOS","M2",{"$f":"OFFSET(PLQ!$E$12,ROW($P76)-ROW(P$12),0)","v":190.42},9.98,"BDI 1",12.63,2405,"",{"$f":"IF(OR($A76=0,$A76=\"S\",$A76>CFF!$A$9),\"\",MAX(V$12:OFFSET(V76,-1,0))+1)","v":""},"SINAPI-88488",10843,{"$f":"IF(Import.Desoneracao=\"sim\",Referencia.Desonerado,Referencia.NaoDesonerado)","v":11.74},{"$f":"ROUND(IF(ISNUMBER(R76),R76,IF(LEFT(R76,3)=\"BDI\",HLOOKUP(R76,DADOS!$T$37:$X$38,2,FALSE),0)),15-11*$X$5)","v":0.26519999999999999}]
["S",0,1,13,0,0,3,{"$f":"IF(OR($A77=\"S\",$A77=0),0,MATCH(0,OFFSET($B77,1,$A77,ROW($A$167)-ROW($A77)),0))","v":0},{"$f":"IF(OR($A77=\"S\",$A77=0),0,MATCH(OFFSET($B77,0,$A77)+1,OFFSET($B77,1,$A77,ROW($A$167)-ROW($A77)),0))","v":0},"Serviço","1.13.3.","SINAPI","88489","APLICAÇÃO MANUAL DE PINTURA COM TINTA LÁTEX ACRÍLICA EM PAREDES, DUAS DEMÃOS","M2",{"$f":"OFFSET(PLQ!$E$12,ROW($P77)-ROW(P$12),0)","v":2050.58},8.7899999999999991,"BDI 1",11.12,22802.45,"",{"$f":"IF(OR($A77=0,$A77=\"S\",$A77>CFF!$A$9),\"\",MAX(V$12:OFFSET(V77,-1,0))+1)","v":""},"SINAPI-88489",10844,{"$f":"IF(Import.Desoneracao=\"sim\",Referencia.Desonerado,Referencia.NaoDesonerado)","v":10.34},{"$f":"ROUND(IF(ISNUMBER(R77),R77,IF(LEFT(R77,3)=\"BDI\",HLOOKUP(R77,DADOS!$T$37:$X$38,2,FALSE),0)),15-11*$X$5)","v":0.26519999999999999}]
["S",0,1,13,0,0,4,0,0,"Serviço","1.13.4.","SINAPI","88484","APLICAÇÃO DE FUNDO SELADOR LÁTEX PVA EM TETO, UMA DEMÃO","M2",{"$f":"OFFSET(PLQ!$E$12,ROW($P78)-ROW(P$12),0)","v":190.42},1.8,"BDI 1",2.2799999999999998,434.16,"",{"$f":"IF(OR($A78=0,$A78=\"S\",$A78>CFF!$A$9),\"\",MAX(V$12:OFFSET(V78,-1,0))+1)","v":""},"SINAPI-88484",10839,{"$f":"IF(Import.Desoneracao=\"sim\",Referencia.Desonerado,Referencia.NaoDesonerado)","v":2.12},{"$f":"ROUND(IF(ISNUMBER(R78),R78,IF(LEFT(R78,3)=\"BDI\",HLOOKUP(R78,DADOS!$T$37:$X$38,2,FALSE),0)),15-11*$X$5)","v":0.26519999999999999}]
["S",0,1,13,0,0,5,0,0,"Serviço","1.13.5.","SINAPI","88485","APLICAÇÃO DE FUNDO SELADOR LÁTEX PVA EM PAREDES, UMA DEMÃO","M2",{"$f":"OFFSET(PLQ!$E$12,ROW($P79)-ROW(P$12),0)","v":2050.58},1.55,"BDI 1",{"$f":"IF($A79=\"S\",IF($Q$10=\"Preço Unitário (R$)\",PO.CustoUnitario,ROUND(PO.CustoUnitario*(1+$Z79),15-13*$X$6)),0)","v":1.96},{"$f":"IF($A79=\"S\",VTOTAL1,IF($A79=0,0,ROUND(SomaAgrup,15-13*$X$7)))","v":4019.14},"",{"$f":"IF(OR($A79=0,$A79=\"S\",$A79>CFF!$A$9),\"\",MAX(V$12:OFFSET(V79,-1,0))+1)","v":""},"SINAPI-88485",{"$f":"IF(AND(Fonte<>\"\",Código<>\"\"),MATCH(Fonte&\" \"&IF(Fonte=\"sinapi\",SUBSTITUTE(SUBSTITUTE(Código,\"/00\",\"/\"),\"/0\",\"/\"),Código),INDIRECT(\"'[Referência \"&_xlnm.Database&\".xls]Banco'!$a:$a\"),0),\"X\")","v":10840},{"$f":"IF(Import.Desoneracao=\"sim\",Referencia.Desonerado,Referencia.NaoDesonerado)","v":1.82},{"$f":"ROUND(IF(ISNUMBER(R79),R79,IF(LEFT(R79,3)=\"BDI\",HLOOKUP(R79,DADOS!$T$37:$X$38,2,FALSE),0)),15-11*$X$5)","v":0.26519999999999999}]
["S",0,1,13,0,0,6,0,0,"Serviço","1.13.6.","SINAPI","73739/1","PINTURA ESMALTE ACETINADO EM MADEIRA, DUAS DEMAOS","M2",{"$f":"OFFSET(PLQ!$E$12,ROW($P80)-ROW(P$12),0)","v":93.24},12.83,"BDI 1",16.23,1513.29,"",{"$f":"IF(OR($A80=0,$A80=\"S\",$A80>CFF!$A$9),\"\",MAX(V$12:OFFSET(V80,-1,0))+1)","v":""},"SINAPI-73739/1",10879,{"$f":"IF(Import.Desoneracao=\"sim\",Referencia.Desonerado,Referencia.NaoDesonerado)","v":15.09},{"$f":"ROUND(IF(ISNUMBER(R80),R80,IF(LEFT(R80,3)=\"BDI\",HLOOKUP(R80,DADOS!$T$37:$X$38,2,FALSE),0)),15-11*$X$5)","v":0.26519999999999999}]
[2,15,1,14,0,0,0,86,15,"Nível 2","1.14.",null,null,"APARELHOS SANITÁRIOS",{"$f":"Referencia.Unidade","v":""},{"$f":"OFFSET(PLQ!$E$12,ROW($P81)-ROW(P$12),0)","v":0},null,"BDI 1",0,13998.22,"",{"$f":"IF(OR($A81=0,$A81=\"S\",$A81>CFF!$A$9),\"\",MAX(V$12:OFFSET(V81,-1,0))+1)","v":15},false,"X",{"$f":"IF(Import.Desoneracao=\"sim\",Referencia.Desonerado,Referencia.NaoDesonerado)","v":0},{"$f":"ROUND(IF(ISNUMBER(R81),R81,IF(LEFT(R81,3)=\"BDI\",HLOOKUP(R81,DADOS!$T$37:$X$38,2,FALSE),0)),15-11*$X$5)","v":0.26519999999999999}]
[{"$f":"CHOOSE(1+LOG(1+2*(J82=\"Meta\")+4*(J82=\"Nível 2\")+8*(J82=\"Nível 3\")+16*(J82=\"Nível 4\")+32*(J82=\"Serviço\"),2),0,1,2,3,4,\"S\")","v":"S"},{"$f":"IF(OR(A82=\"S\",A82=0),0,IF(ISERROR(I82),H82,SMALL(H82:I82,1)))","v":0},{"$f":"IF($A82=1,OFFSET(C82,-1,0)+1,OFFSET(C82,-1,0))","v":1},{"$f":"IF($A82=1,0,IF($A82=2,OFFSET(D82,-1,0)+1,OFFSET(D82,-1,0)))","v":14},{"$f":"IF(AND($A82<=2,$A82<>0),0,IF($A82=3,OFFSET(E82,-1,0)+1,OFFSET(E82,-1,0)))","v":0},{"$f":"IF(AND($A82<=3,$A82<>0),0,IF($A82=4,OFFSET(F82,-1,0)+1,OFFSET(F82,-1,0)))","v":0},{"$f":"IF(AND($A82<=4,$A82<>0),0,IF($A82=\"S\",OFFSET(G82,-1,0)+1,OFFSET(G82,-1,0)))","v":1},0,0,"Serviço",{"$f":"IF($A82=0,\"-\",CONCATENATE(C82&\".\",IF(AND($A$5>=2,$A82>=2),D82&\".\",\"\"),IF(AND($A$5>=3,$A82>=3),E82&\".\",\"\"),IF(AND($A$5>=4,$A82>=4),F82&\".\",\"\"),IF($A82=\"S\",G82&\".\",\"\")))","v":"1.14.1."},"SINAPI",86943,"LAVATÓRIO LOUÇA BRANCA SUSPENSO, 29,5 X 39CM OU EQUIVALENTE, INCLUSO SIFÃO FLEXÍVEL EM PVC, VÁLVULA E ENGATE FLEXÍVEL 30CM EM PLÁSTICO E TORNEIRA CROMADA DE MESA FORNECIMENTO E INSTALAÇÃO","UN",{"$f":"OFFSET(PLQ!$E$12,ROW($P82)-ROW(P$12),0)","v":4},137.9,"BDI 1",174.47,697.88,{"$f":"IF($J82=\"\",\"\",IF($N82=\"\",\"DESCRIÇÃO\",IF(AND($J82=\"Serviço\",$O82=\"\"),\"UNIDADE\",IF($T82<=0,\"SEM VALOR\",IF(AND($Y82<>\"\",$Q82>$Y82),\"ACIMA REF.\",\"\")))))","v":""},{"$f":"IF(OR($A82=0,$A82=\"S\",$A82>CFF!$A$9),\"\",MAX(V$12:OFFSET(V82,-1,0))+1)","v":""},{"$f":"IF(AND($J82=\"Serviço\",$M82<>\"\"),IF($L82=\"\",$M82,CONCATENATE($L82,\"-\",$M82)))","v":"SINAPI-86943"},10046,{"$f":"IF(Import.Desoneracao=\"sim\",Referencia.Desonerado,Referencia.NaoDesonerado)","v":162.24},{"$f":"ROUND(IF(ISNUMBER(R82),R82,IF(LEFT(R82,3)=\"BDI\",HLOOKUP(R82,DADOS!$T$37:$X$38,2,FALSE),0)),15-11*$X$5)","v":0.26519999999999999}]
["S",0,1,14,0,0,2,0,0,"Serviço","1.14.2.","SINAPI","86895","BANCADA DE GRANITO CINZA POLIDO PARA LAVATÓRIO 0,50 X 0,60 M - FORNECIMENTO E INSTALAÇÃO","UN",{"$f":"OFFSET(PLQ!$E$12,ROW($P83)-ROW(P$12),0)","v":6},195.97,"BDI 1",247.94,1487.64,"",{"$f":"IF(OR($A83=0,$A83=\"S\",$A83>CFF!$A$9),\"\",MAX(V$12:OFFSET(V83,-1,0))+1)","v":""},"SINAPI-86895",10004,{"$f":"IF(Import.Desoneracao=\"sim\",Referencia.Desonerado,Referencia.NaoDesonerado)","v":230.55},{"$f":"ROUND(IF(ISNUMBER(R83),R83,IF(LEFT(R83,3)=\"BDI\",HLOOKUP(R83,DADOS!$T$37:$X$38,2,FALSE),0)),15-11*$X$5)","v":0.26519999999999999}]
[{"$f":"CHOOSE(1+LOG(1+2*(J84=\"Meta\")+4*(J84=\"Nível 2\")+8*(J84=\"Nível 3\")+16*(J84=\"Nível 4\")+32*(J84=\"Serviço\"),2),0,1,2,3,4,\"S\")","v":"S"},{"$f":"IF(OR(A84=\"S\",A84=0),0,IF(ISERROR(I84),H84,SMALL(H84:I84,1)))","v":0},{"$f":"IF($A84=1,OFFSET(C84,-1,0)+1,OFFSET(C84,-1,0))","v":1},{"$f":"IF($A84=1,0,IF($A84=2,OFFSET(D84,-1,0)+1,OFFSET(D84,-1,0)))","v":14},{"$f":"IF(AND($A84<=2,$A84<>0),0,IF($A84=3,OFFSET(E84,-1,0)+1,OFFSET(E84,-1,0)))","v":0},{"$f":"IF(AND($A84<=3,$A84<>0),0,IF($A84=4,OFFSET(F84,-1,0)+1,OFFSET(F84,-1,0)))","v":0},{"$f":"IF(AND($A84<=4,$A84<>0),0,IF($A84=\"S\",OFFSET(G84,-1,0)+1,OFFSET(G84,-1,0)))","v":3},0,0,"Serviço",{"$f":"IF($A84=0,\"-\",CONCATENATE(C84&\".\",IF(AND($A$5>=2,$A84>=2),D84&\".\",\"\"),IF(AND($A$5>=3,$A84>=3),E84&\".\",\"\"),IF(AND($A$5>=4,$A84>=4),F84&\".\",\"\"),IF($A84=\"S\",G84&\".\",\"\")))","v":"1.14.3."},"SINAPI-I","10427","LAVATORIO/CUBA DE SOBREPOR RETANGULAR LOUCA BRANCA COM LADRAO *52 X 45* CM","UN",{"$f":"OFFSET(PLQ!$E$12,ROW($P84)-ROW(P$12),0)","v":6},153.97,"BDI 1",{"$f":"IF($A84=\"S\",IF($Q$10=\"Preço Unitário (R$)\",PO.CustoUnitario,ROUND(PO.CustoUnitario*(1+$Z84),15-13*$X$6)),0)","v":194.8},{"$f":"IF($A84=\"S\",VTOTAL1,IF($A84=0,0,ROUND(SomaAgrup,15-13*$X$7)))","v":1168.8},{"$f":"IF($J84=\"\",\"\",IF($N84=\"\",\"DESCRIÇÃO\",IF(AND($J84=\"Serviço\",$O84=\"\"),\"UNIDADE\",IF($T84<=0,\"SEM VALOR\",IF(AND($Y84<>\"\",$Q84>$Y84),\"ACIMA REF.\",\"\")))))","v":""},{"$f":"IF(OR($A84=0,$A84=\"S\",$A84>CFF!$A$9),\"\",MAX(V$12:OFFSET(V84,-1,0))+1)","v":""},{"$f":"IF(AND($J84=\"Serviço\",$M84<>\"\"),IF($L84=\"\",$M84,CONCATENATE($L84,\"-\",$M84)))","v":"SINAPI-I-10427"},{"$f":"IF(AND(Fonte<>\"\",Código<>\"\"),MATCH(Fonte&\" \"&IF(Fonte=\"sinapi\",SUBSTITUTE(SUBSTITUTE(Código,\"/00\",\"/\"),\"/0\",\"/\"),Código),INDIRECT(\"'[Referência \"&_xlnm.Database&\".xls]Banco'!$a:$a\"),0),\"X\")","v":3154},{"$f":"IF(Import.Desoneracao=\"sim\",Referencia.Desonerado,Referencia.NaoDesonerado)","v":181.14},{"$f":"ROUND(IF(ISNUMBER(R84),R84,IF(LEFT(R84,3)=\"BDI\",HLOOKUP(R84,DADOS!$T$37:$X$38,2,FALSE),0)),15-11*$X$5)","v":0.26519999999999999}]
[{"$f":"CHOOSE(1+LOG(1+2*(J85=\"Meta\")+4*(J85=\"Nível 2\")+8*(J85=\"Nível 3\")+16*(J85=\"Nível 4\")+32*(J85=\"Serviço\"),2),0,1,2,3,4,\"S\")","v":"S"},{"$f":"IF(OR(A85=\"S\",A85=0),0,IF(ISERROR(I85),H85,SMALL(H85:I85,1)))","v":0},{"$f":"IF($A85=1,OFFSET(C85,-1,0)+1,OFFSET(C85,-1,0))","v":1},{"$f":"IF($A85=1,0,IF($A85=2,OFFSET(D85,-1,0)+1,OFFSET(D85,-1,0)))","v":14},{"$f":"IF(AND($A85<=2,$A85<>0),0,IF($A85=3,OFFSET(E85,-1,0)+1,OFFSET(E85,-1,0)))","v":0},{"$f":"IF(AND($A85<=3,$A85<>0),0,IF($A85=4,OFFSET(F85,-1,0)+1,OFFSET(F85,-1,0)))","v":0},{"$f":"IF(AND($A85<=4,$A85<>0),0,IF($A85=\"S\",OFFSET(G85,-1,0)+1,OFFSET(G85,-1,0)))","v":4},0,0,"Serviço",{"$f":"IF($A85=0,\"-\",CONCATENATE(C85&\".\",IF(AND($A$5>=2,$A85>=2),D85&\".\",\"\"),IF(AND($A$5>=3,$A85>=3),E85&\".\",\"\"),IF(AND($A$5>=4,$A85>=4),F85&\".\",\"\"),IF($A85=\"S\",G85&\".\",\"\")))","v":"1.14.4."},"SINAPI","86883","SIFÃO DO TIPO FLEXÍVEL EM PVC 1\u0094 X 1.1/2\u0094 - FORNECIMENTO E INSTALAÇÃO","UN",{"$f":"OFFSET(PLQ!$E$12,ROW($P85)-ROW(P$12),0)","v":6},6.8,"BDI 1",{"$f":"IF($A85=\"S\",IF($Q$10=\"Preço Unitário (R$)\",PO.CustoUnitario,ROUND(PO.CustoUnitario*(1+$Z85),15-13*$X$6)),0)","v":8.6},{"$f":"IF($A85=\"S\",VTOTAL1,IF($A85=0,0,ROUND(SomaAgrup,15-13*$X$7)))","v":51.6},{"$f":"IF($J85=\"\",\"\",IF($N85=\"\",\"DESCRIÇÃO\",IF(AND($J85=\"Serviço\",$O85=\"\"),\"UNIDADE\",IF($T85<=0,\"SEM VALOR\",IF(AND($Y85<>\"\",$Q85>$Y85),\"ACIMA REF.\",\"\")))))","v":""},{"$f":"IF(OR($A85=0,$A85=\"S\",$A85>CFF!$A$9),\"\",MAX(V$12:OFFSET(V85,-1,0))+1)","v":""},{"$f":"IF(AND($J85=\"Serviço\",$M85<>\"\"),IF($L85=\"\",$M85,CONCATENATE($L85,\"-\",$M85)))","v":"SINAPI-86883"},{"$f":"IF(AND(Fonte<>\"\",Código<>\"\"),MATCH(Fonte&\" \"&IF(Fonte=\"sinapi\",SUBSTITUTE(SUBSTITUTE(Código,\"/00\",\"/\"),\"/0\",\"/\"),Código),INDIRECT(\"'[Referência \"&_xlnm.Database&\".xls]Banco'!$a:$a\"),0),\"X\")","v":9995},{"$f":"IF(Import.Desoneracao=\"sim\",Referencia.Desonerado,Referencia.NaoDesonerado)","v":8},{"$f":"ROUND(IF(ISNUMBER(R85),R85,IF(LEFT(R85,3)=\"BDI\",HLOOKUP(R85,DADOS!$T$37:$X$38,2,FALSE),0)),15-11*$X$5)","v":0.26519999999999999}]
[{"$f":"CHOOSE(1+LOG(1+2*(J86=\"Meta\")+4*(J86=\"Nível 2\")+8*(J86=\"Nível 3\")+16*(J86=\"Nível 4\")+32*(J86=\"Serviço\"),2),0,1,2,3,4,\"S\")","v":"S"},{"$f":"IF(OR(A86=\"S\",A86=0),0,IF(ISERROR(I86),H86,SMALL(H86:I86,1)))","v":0},{"$f":"IF($A86=1,OFFSET(C86,-1,0)+1,OFFSET(C86,-1,0))","v":1},{"$f":"IF($A86=1,0,IF($A86=2,OFFSET(D86,-1,0)+1,OFFSET(D86,-1,0)))","v":14},{"$f":"IF(AND($A86<=2,$A86<>0),0,IF($A86=3,OFFSET(E86,-1,0)+1,OFFSET(E86,-1,0)))","v":0},{"$f":"IF(AND($A86<=3,$A86<>0),0,IF($A86=4,OFFSET(F86,-1,0)+1,OFFSET(F86,-1,0)))","v":0},{"$f":"IF(AND($A86<=4,$A86<>0),0,IF($A86=\"S\",OFFSET(G86,-1,0)+1,OFFSET(G86,-1,0)))","v":5},0,0,"Serviço",{"$f":"IF($A86=0,\"-\",CONCATENATE(C86&\".\",IF(AND($A$5>=2,$A86>=2),D86&\".\",\"\"),IF(AND($A$5>=3,$A86>=3),E86&\".\",\"\"),IF(AND($A$5>=4,$A86>=4),F86&\".\",\"\"),IF($A86=\"S\",G86&\".\",\"\")))","v":"1.14.5."},"SINAPI","86886","ENGATE FLEXÍVEL EM INOX, 1/2\u0094 X 30CM - FORNECIMENTO E INSTALAÇÃO","UN",{"$f":"OFFSET(PLQ!$E$12,ROW($P86)-ROW(P$12),0)","v":6},36.28,"BDI 1",{"$f":"IF($A86=\"S\",IF($Q$10=\"Preço Unitário (R$)\",PO.CustoUnitario,ROUND(PO.CustoUnitario*(1+$Z86),15-13*$X$6)),0)","v":45.9},{"$f":"IF($A86=\"S\",VTOTAL1,IF($A86=0,0,ROUND(SomaAgrup,15-13*$X$7)))","v":275.39999999999998},{"$f":"IF($J86=\"\",\"\",IF($N86=\"\",\"DESCRIÇÃO\",IF(AND($J86=\"Serviço\",$O86=\"\"),\"UNIDADE\",IF($T86<=0,\"SEM VALOR\",IF(AND($Y86<>\"\",$Q86>$Y86),\"ACIMA REF.\",\"\")))))","v":""},{"$f":"IF(OR($A86=0,$A86=\"S\",$A86>CFF!$A$9),\"\",MAX(V$12:OFFSET(V86,-1,0))+1)","v":""},{"$f":"IF(AND($J86=\"Serviço\",$M86<>\"\"),IF($L86=\"\",$M86,CONCATENATE($L86,\"-\",$M86)))","v":"SINAPI-86886"},{"$f":"IF(AND(Fonte<>\"\",Código<>\"\"),MATCH(Fonte&\" \"&IF(Fonte=\"sinapi\",SUBSTITUTE(SUBSTITUTE(Código,\"/00\",\"/\"),\"/0\",\"/\"),Código),INDIRECT(\"'[Referência \"&_xlnm.Database&\".xls]Banco'!$a:$a\"),0),\"X\")","v":9998},{"$f":"IF(Import.Desoneracao=\"sim\",Referencia.Desonerado,Referencia.NaoDesonerado)","v":42.68},{"$f":"ROUND(IF(ISNUMBER(R86),R86,IF(LEFT(R86,3)=\"BDI\",HLOOKUP(R86,DADOS!$T$37:$X$38,2,FALSE),0)),15-11*$X$5)","v":0.26519999999999999}]
["S",0,1,14,0,0,6,0,0,"Serviço","1.14.6.","SINAPI","95472","VASO SANITARIO SIFONADO CONVENCIONAL PARA PCD COM LOUÇA BRANCA SEM ASSENTO, INCLUSO CONJUNTO DE LIGAÇÃO PARA BACIA SANITÁRIA AJUSTÁVEL - FORNECIMENTO E INSTALAÇÃO","UN",{"$f":"OFFSET(PLQ!$E$12,ROW($P87)-ROW(P$12),0)","v":4},450,"BDI 1",569.34,2277.36,"",{"$f":"IF(OR($A87=0,$A87=\"S\",$A87>CFF!$A$9),\"\",MAX(V$12:OFFSET(V87,-1,0))+1)","v":""},"SINAPI-95472",10055,{"$f":"IF(Import.Desoneracao=\"sim\",Referencia.Desonerado,Referencia.NaoDesonerado)","v":543.54999999999995},{"$f":"ROUND(IF(ISNUMBER(R87),R87,IF(LEFT(R87,3)=\"BDI\",HLOOKUP(R87,DADOS!$T$37:$X$38,2,FALSE),0)),15-11*$X$5)","v":0.26519999999999999}]
["S",0,1,14,0,0,7,0,0,"Serviço","1.14.7.","SINAPI",86888,"VASO SANITÁRIO SIFONADO COM CAIXA ACOPLADA LOUÇA BRANCA - FORNECIMENTO E INSTALAÇÃO","UN",{"$f":"OFFSET(PLQ!$E$12,ROW($P88)-ROW(P$12),0)","v":6},262.97000000000003,"BDI 1",332.71,1996.26,"",{"$f":"IF(OR($A88=0,$A88=\"S\",$A88>CFF!$A$9),\"\",MAX(V$12:OFFSET(V88,-1,0))+1)","v":""},"SINAPI-86888",10000,{"$f":"IF(Import.Desoneracao=\"sim\",Referencia.Desonerado,Referencia.NaoDesonerado)","v":309.38},{"$f":"ROUND(IF(ISNUMBER(R88),R88,IF(LEFT(R88,3)=\"BDI\",HLOOKUP(R88,DADOS!$T$37:$X$38,2,FALSE),0)),15-11*$X$5)","v":0.26519999999999999}]
["S",0,1,14,0,0,8,0,0,"Serviço","1.14.8.","SINAPI-I","36795","TORNEIRA CROMADA DE MESA PARA LAVATORIO COM SENSOR DE PRESENCA","UN",{"$f":"OFFSET(PLQ!$E$12,ROW($P89)-ROW(P$12),0)","v":10},300,"BDI 1",379.56,3795.6,"",{"$f":"IF(OR($A89=0,$A89=\"S\",$A89>CFF!$A$9),\"\",MAX(V$12:OFFSET(V89,-1,0))+1)","v":""},"SINAPI-I-36795",5065,{"$f":"IF(Import.Desoneracao=\"sim\",Referencia.Desonerado,Referencia.NaoDesonerado)","v":655.94},{"$f":"ROUND(IF(ISNUMBER(R89),R89,IF(LEFT(R89,3)=\"BDI\",HLOOKUP(R89,DADOS!$T$37:$X$38,2,FALSE),0)),15-11*$X$5)","v":0.26519999999999999}]
["S",0,1,14,0,0,9,0,0,"Serviço","1.14.9.","SINAPI-I",37400,"PAPELEIRA PLASTICA TIPO DISPENSER PARA PAPEL HIGIENICO ROLAO","UN",{"$f":"OFFSET(PLQ!$E$12,ROW($P90)-ROW(P$12),0)","v":6},49.47,"BDI 1",62.59,375.54,"",{"$f":"IF(OR($A90=0,$A90=\"S\",$A90>CFF!$A$9),\"\",MAX(V$12:OFFSET(V90,-1,0))+1)","v":""},"SINAPI-I-37400",3789,{"$f":"IF(Import.Desoneracao=\"sim\",Referencia.Desonerado,Referencia.NaoDesonerado)","v":58.2},{"$f":"ROUND(IF(ISNUMBER(R90),R90,IF(LEFT(R90,3)=\"BDI\",HLOOKUP(R90,DADOS!$T$37:$X$38,2,FALSE),0)),15-11*$X$5)","v":0.26519999999999999}]
["S",0,1,14,0,0,10,0,0,"Serviço","1.14.10.","SINAPI-I","11758","SABONETEIRA PLASTICA TIPO DISPENSER PARA SABONETE LIQUIDO COM RESERVATORIO 800 A 1500 ML","UN",{"$f":"OFFSET(PLQ!$E$12,ROW($P91)-ROW(P$12),0)","v":6},47.52,"BDI 1",60.12,360.72,"",{"$f":"IF(OR($A91=0,$A91=\"S\",$A91>CFF!$A$9),\"\",MAX(V$12:OFFSET(V91,-1,0))+1)","v":""},"SINAPI-I-11758",4459,{"$f":"IF(Import.Desoneracao=\"sim\",Referencia.Desonerado,Referencia.NaoDesonerado)","v":55.9},{"$f":"ROUND(IF(ISNUMBER(R91),R91,IF(LEFT(R91,3)=\"BDI\",HLOOKUP(R91,DADOS!$T$37:$X$38,2,FALSE),0)),15-11*$X$5)","v":0.26519999999999999}]
["S",0,1,14,0,0,11,0,0,"Serviço","1.14.11.","SINAPI-I",37399,"CABIDE/GANCHO DE BANHEIRO SIMPLES EM METAL CROMADO","UN",{"$f":"OFFSET(PLQ!$E$12,ROW($P92)-ROW(P$12),0)","v":4},14.29,"BDI 1",18.079999999999998,72.319999999999993,"",{"$f":"IF(OR($A92=0,$A92=\"S\",$A92>CFF!$A$9),\"\",MAX(V$12:OFFSET(V92,-1,0))+1)","v":""},"SINAPI-I-37399",1080,{"$f":"IF(Import.Desoneracao=\"sim\",Referencia.Desonerado,Referencia.NaoDesonerado)","v":16.809999999999999},{"$f":"ROUND(IF(ISNUMBER(R92),R92,IF(LEFT(R92,3)=\"BDI\",HLOOKUP(R92,DADOS!$T$37:$X$38,2,FALSE),0)),15-11*$X$5)","v":0.26519999999999999}]
["S",0,1,14,0,0,12,0,0,"Serviço","1.14.12.","SINAPI-I",11795,"GRANITO PARA BANCADA, POLIDO, TIPO ANDORINHA/ QUARTZ/ CASTELO/ CORUMBA OU OUTROS EQUIVALENTES DA REGIAO, E=  *2,5* CM","M2",{"$f":"OFFSET(PLQ!$E$12,ROW($P93)-ROW(P$12),0)","v":0.24},263.02,"BDI 1",332.77,79.86,"",{"$f":"IF(OR($A93=0,$A93=\"S\",$A93>CFF!$A$9),\"\",MAX(V$12:OFFSET(V93,-1,0))+1)","v":""},"SINAPI-I-11795",2696,{"$f":"IF(Import.Desoneracao=\"sim\",Referencia.Desonerado,Referencia.NaoDesonerado)","v":309.43},{"$f":"ROUND(IF(ISNUMBER(R93),R93,IF(LEFT(R93,3)=\"BDI\",HLOOKUP(R93,DADOS!$T$37:$X$38,2,FALSE),0)),15-11*$X$5)","v":0.26519999999999999}]
["S",0,1,14,0,0,13,0,0,"Serviço","1.14.13.","SINAPI-I",11186,"ESPELHO CRISTAL E = 4 MM","M2",{"$f":"OFFSET(PLQ!$E$12,ROW($P94)-ROW(P$12),0)","v":5.4},165.69,"BDI 1",209.63,1132,"",{"$f":"IF(OR($A94=0,$A94=\"S\",$A94>CFF!$A$9),\"\",MAX(V$12:OFFSET(V94,-1,0))+1)","v":""},"SINAPI-I-11186",2451,{"$f":"IF(Import.Desoneracao=\"sim\",Referencia.Desonerado,Referencia.NaoDesonerado)","v":194.93},{"$f":"ROUND(IF(ISNUMBER(R94),R94,IF(LEFT(R94,3)=\"BDI\",HLOOKUP(R94,DADOS!$T$37:$X$38,2,FALSE),0)),15-11*$X$5)","v":0.26519999999999999}]
["S",0,1,14,0,0,14,0,0,"Serviço","1.14.14.","SINAPI","86927","TANQUE DE MÁRMORE SINTÉTICO SUSPENSO, 22L OU EQUIVALENTE, INCLUSO SIFÃO TIPO GARRAFA EM PVC, VÁLVULA PLÁSTICA E TORNEIRA DE METAL CROMADO - FORNECIMENTO E INSTALAÇÃO","UN",{"$f":"OFFSET(PLQ!$E$12,ROW($P95)-ROW(P$12),0)","v":1},179.61,"BDI 1",227.24,227.24,"",{"$f":"IF(OR($A95=0,$A95=\"S\",$A95>CFF!$A$9),\"\",MAX(V$12:OFFSET(V95,-1,0))+1)","v":""},"SINAPI-86927",10030,{"$f":"IF(Import.Desoneracao=\"sim\",Referencia.Desonerado,Referencia.NaoDesonerado)","v":211.3},{"$f":"ROUND(IF(ISNUMBER(R95),R95,IF(LEFT(R95,3)=\"BDI\",HLOOKUP(R95,DADOS!$T$37:$X$38,2,FALSE),0)),15-11*$X$5)","v":0.26519999999999999}]
[2,10,1,15,0,0,0,71,10,"Nível 2","1.15.",null,null,"INSTALAÇÕES HIDRAULICAS",{"$f":"Referencia.Unidade","v":""},{"$f":"OFFSET(PLQ!$E$12,ROW($P96)-ROW(P$12),0)","v":0},null,"BDI 1",0,5935.38,"",{"$f":"IF(OR($A96=0,$A96=\"S\",$A96>CFF!$A$9),\"\",MAX(V$12:OFFSET(V96,-1,0))+1)","v":16},false,"X",{"$f":"IF(Import.Desoneracao=\"sim\",Referencia.Desonerado,Referencia.NaoDesonerado)","v":0},{"$f":"ROUND(IF(ISNUMBER(R96),R96,IF(LEFT(R96,3)=\"BDI\",HLOOKUP(R96,DADOS!$T$37:$X$38,2,FALSE),0)),15-11*$X$5)","v":0.26519999999999999}]
["S",0,1,15,0,0,1,0,0,"Serviço","1.15.1.","SINAPI","95675","HIDRÔMETRO DN 25 (¾ ), 5,0 M³/H FORNECIMENTO E INSTALAÇÃO","UN",{"$f":"OFFSET(PLQ!$E$12,ROW($P97)-ROW(P$12),0)","v":1},150.58000000000001,"BDI 1",190.51,190.51,"",{"$f":"IF(OR($A97=0,$A97=\"S\",$A97>CFF!$A$9),\"\",MAX(V$12:OFFSET(V97,-1,0))+1)","v":""},"SINAPI-95675",10194,{"$f":"IF(Import.Desoneracao=\"sim\",Referencia.Desonerado,Referencia.NaoDesonerado)","v":177.15},{"$f":"ROUND(IF(ISNUMBER(R97),R97,IF(LEFT(R97,3)=\"BDI\",HLOOKUP(R97,DADOS!$T$37:$X$38,2,FALSE),0)),15-11*$X$5)","v":0.26519999999999999}]
["S",0,1,15,0,0,2,0,0,"Serviço","1.15.2.","SINAPI","95635","KIT CAVALETE PARA MEDIÇÃO DE ÁGUA - ENTRADA PRINCIPAL, EM PVC SOLDÁVEL DN 25 (¾ )   FORNECIMENTO E INSTALAÇÃO ","UN",{"$f":"OFFSET(PLQ!$E$12,ROW($P98)-ROW(P$12),0)","v":1},82.44,"BDI 1",104.3,104.3,"",{"$f":"IF(OR($A98=0,$A98=\"S\",$A98>CFF!$A$9),\"\",MAX(V$12:OFFSET(V98,-1,0))+1)","v":""},"SINAPI-95635",10181,{"$f":"IF(Import.Desoneracao=\"sim\",Referencia.Desonerado,Referencia.NaoDesonerado)","v":96.99},{"$f":"ROUND(IF(ISNUMBER(R98),R98,IF(LEFT(R98,3)=\"BDI\",HLOOKUP(R98,DADOS!$T$37:$X$38,2,FALSE),0)),15-11*$X$5)","v":0.26519999999999999}]
["S",0,1,15,0,0,3,0,0,"Serviço","1.15.3.","SINAPI","95676","CAIXA EM CONCRETO PRÉ-MOLDADO PARA ABRIGO DE HIDRÔMETRO COM DN 20 (½\u0094) \u0096 FORNECIMENTO E INSTALAÇÃO","UN",{"$f":"OFFSET(PLQ!$E$12,ROW($P99)-ROW(P$12),0)","v":1},51.14,"BDI 1",64.7,64.7,"",{"$f":"IF(OR($A99=0,$A99=\"S\",$A99>CFF!$A$9),\"\",MAX(V$12:OFFSET(V99,-1,0))+1)","v":""},"SINAPI-95676",10195,{"$f":"IF(Import.Desoneracao=\"sim\",Referencia.Desonerado,Referencia.NaoDesonerado)","v":60.16},{"$f":"ROUND(IF(ISNUMBER(R99),R99,IF(LEFT(R99,3)=\"BDI\",HLOOKUP(R99,DADOS!$T$37:$X$38,2,FALSE),0)),15-11*$X$5)","v":0.26519999999999999}]
["S",0,1,15,0,0,4,0,0,"Serviço","1.15.4.","SINAPI","91784","TUBOS DE PVC, SOLDÁVEL, ÁGUA FRIA, DN 20 MM, INCLUSIVE CONEXÕES, CORTES E FIXAÇÕES","M",{"$f":"OFFSET(PLQ!$E$12,ROW($P100)-ROW(P$12),0)","v":43.6},26.53,"BDI 1",33.57,1463.65,"",{"$f":"IF(OR($A100=0,$A100=\"S\",$A100>CFF!$A$9),\"\",MAX(V$12:OFFSET(V100,-1,0))+1)","v":""},"SINAPI-91784",8724,{"$f":"IF(Import.Desoneracao=\"sim\",Referencia.Desonerado,Referencia.NaoDesonerado)","v":31.21},{"$f":"ROUND(IF(ISNUMBER(R100),R100,IF(LEFT(R100,3)=\"BDI\",HLOOKUP(R100,DADOS!$T$37:$X$38,2,FALSE),0)),15-11*$X$5)","v":0.26519999999999999}]
["S",0,1,15,0,0,5,0,0,"Serviço","1.15.5.","SINAPI","91785","TUBOS DE PVC, SOLDÁVEL, ÁGUA FRIA, DN 25 MM, INCLUSIVE CONEXÕES, CORTES E FIXAÇÕES","M",{"$f":"OFFSET(PLQ!$E$12,ROW($P101)-ROW(P$12),0)","v":85.99},26.44,"BDI 1",33.450000000000003,2876.37,"",{"$f":"IF(OR($A101=0,$A101=\"S\",$A101>CFF!$A$9),\"\",MAX(V$12:OFFSET(V101,-1,0))+1)","v":""},"SINAPI-91785",8725,{"$f":"IF(Import.Desoneracao=\"sim\",Referencia.Desonerado,Referencia.NaoDesonerado)","v":31.11},{"$f":"ROUND(IF(ISNUMBER(R101),R101,IF(LEFT(R101,3)=\"BDI\",HLOOKUP(R101,DADOS!$T$37:$X$38,2,FALSE),0)),15-11*$X$5)","v":0.26519999999999999}]
["S",0,1,15,0,0,6,0,0,"Serviço","1.15.6.","SINAPI",92567,"ESTRUTURA PONTALETADA DE MADEIRA PARA TELHADOS DE TELHA DE CONCRETO, INCLUSO TRANSPORTE VERTICAL","M2",{"$f":"OFFSET(PLQ!$E$12,ROW($P102)-ROW(P$12),0)","v":1},20.239999999999998,"BDI 1",25.61,25.61,"",{"$f":"IF(OR($A102=0,$A102=\"S\",$A102>CFF!$A$9),\"\",MAX(V$12:OFFSET(V102,-1,0))+1)","v":""},"SINAPI-92567",6883,{"$f":"IF(Import.Desoneracao=\"sim\",Referencia.Desonerado,Referencia.NaoDesonerado)","v":23.81},{"$f":"ROUND(IF(ISNUMBER(R102),R102,IF(LEFT(R102,3)=\"BDI\",HLOOKUP(R102,DADOS!$T$37:$X$38,2,FALSE),0)),15-11*$X$5)","v":0.26519999999999999}]
["S",0,1,15,0,0,7,0,0,"Serviço","1.15.7.","SINAPI-I","37104","CAIXA D'AGUA FIBRA DE VIDRO PARA 2000 LITROS, COM TAMPA","UN",{"$f":"OFFSET(PLQ!$E$12,ROW($P103)-ROW(P$12),0)","v":1},612.97,"BDI 1",775.53,775.53,"",{"$f":"IF(OR($A103=0,$A103=\"S\",$A103>CFF!$A$9),\"\",MAX(V$12:OFFSET(V103,-1,0))+1)","v":""},"SINAPI-I-37104",1245,{"$f":"IF(Import.Desoneracao=\"sim\",Referencia.Desonerado,Referencia.NaoDesonerado)","v":721.14},{"$f":"ROUND(IF(ISNUMBER(R103),R103,IF(LEFT(R103,3)=\"BDI\",HLOOKUP(R103,DADOS!$T$37:$X$38,2,FALSE),0)),15-11*$X$5)","v":0.26519999999999999}]
["S",0,1,15,0,0,8,0,0,"Serviço","1.15.8.","SINAPI-I","6013","REGISTRO GAVETA COM ACABAMENTO E CANOPLA CROMADOS, SIMPLES, BITOLA 1 \" (REF 1509)","UN",{"$f":"OFFSET(PLQ!$E$12,ROW($P104)-ROW(P$12),0)","v":5},58.51,"BDI 1",74.03,370.15,"",{"$f":"IF(OR($A104=0,$A104=\"S\",$A104>CFF!$A$9),\"\",MAX(V$12:OFFSET(V104,-1,0))+1)","v":""},"SINAPI-I-6013",4381,{"$f":"IF(Import.Desoneracao=\"sim\",Referencia.Desonerado,Referencia.NaoDesonerado)","v":68.83},{"$f":"ROUND(IF(ISNUMBER(R104),R104,IF(LEFT(R104,3)=\"BDI\",HLOOKUP(R104,DADOS!$T$37:$X$38,2,FALSE),0)),15-11*$X$5)","v":0.26519999999999999}]
["S",0,1,15,0,0,9,0,0,"Serviço","1.15.9.","SINAPI","90371","REGISTRO DE ESFERA, PVC, ROSCÁVEL, 3/4\", FORNECIDO E INSTALADO EM RAMAL DE ÁGUA","UN",{"$f":"OFFSET(PLQ!$E$12,ROW($P105)-ROW(P$12),0)","v":4},12.76,"BDI 1",16.14,64.56,"",{"$f":"IF(OR($A105=0,$A105=\"S\",$A105>CFF!$A$9),\"\",MAX(V$12:OFFSET(V105,-1,0))+1)","v":""},"SINAPI-90371",10151,{"$f":"IF(Import.Desoneracao=\"sim\",Referencia.Desonerado,Referencia.NaoDesonerado)","v":15.01},{"$f":"ROUND(IF(ISNUMBER(R105),R105,IF(LEFT(R105,3)=\"BDI\",HLOOKUP(R105,DADOS!$T$37:$X$38,2,FALSE),0)),15-11*$X$5)","v":0.26519999999999999}]
[2,13,1,16,0,0,0,61,13,"Nível 2","1.16.","SINAPI",null,"INSTALAÇÕES SANITÁRIAS E PLUVIAIS",{"$f":"Referencia.Unidade","v":""},{"$f":"OFFSET(PLQ!$E$12,ROW($P106)-ROW(P$12),0)","v":0},{"$f":"Y106*0.85","v":0},"BDI 1",0,27268.7,"",{"$f":"IF(OR($A106=0,$A106=\"S\",$A106>CFF!$A$9),\"\",MAX(V$12:OFFSET(V106,-1,0))+1)","v":17},false,"X",{"$f":"IF(Import.Desoneracao=\"sim\",Referencia.Desonerado,Referencia.NaoDesonerado)","v":0},{"$f":"ROUND(IF(ISNUMBER(R106),R106,IF(LEFT(R106,3)=\"BDI\",HLOOKUP(R106,DADOS!$T$37:$X$38,2,FALSE),0)),15-11*$X$5)","v":0.26519999999999999}]
["S",0,1,16,0,0,1,{"$f":"IF(OR($A107=\"S\",$A107=0),0,MATCH(0,OFFSET($B107,1,$A107,ROW($A$167)-ROW($A107)),0))","v":0},{"$f":"IF(OR($A107=\"S\",$A107=0),0,MATCH(OFFSET($B107,0,$A107)+1,OFFSET($B107,1,$A107,ROW($A$167)-ROW($A107)),0))","v":0},"Serviço","1.16.1.","SINAPI",91792,"INSTALAÇÃO DE TUBO DE PVC, SÉRIE NORMAL, ESGOTO PREDIAL, DN 40 MM, INCLUSIVE CONEXÕES, CORTES E FIXAÇÕES","M",{"$f":"OFFSET(PLQ!$E$12,ROW($P107)-ROW(P$12),0)","v":14.7},34.200000000000003,"BDI 1",43.27,636.07000000000005,"",{"$f":"IF(OR($A107=0,$A107=\"S\",$A107>CFF!$A$9),\"\",MAX(V$12:OFFSET(V107,-1,0))+1)","v":""},"SINAPI-91792",8732,{"$f":"IF(Import.Desoneracao=\"sim\",Referencia.Desonerado,Referencia.NaoDesonerado)","v":40.229999999999997},{"$f":"ROUND(IF(ISNUMBER(R107),R107,IF(LEFT(R107,3)=\"BDI\",HLOOKUP(R107,DADOS!$T$37:$X$38,2,FALSE),0)),15-11*$X$5)","v":0.26519999999999999}]
["S",0,1,16,0,0,2,0,0,"Serviço","1.16.2.","SINAPI",91793,"TUBO DE PVC, SÉRIE NORMAL, ESGOTO PREDIAL, DN 50 MM, INCLUSIVE CONEXÕES, CORTES E FIXAÇÕES","M",{"$f":"OFFSET(PLQ!$E$12,ROW($P108)-ROW(P$12),0)","v":51.7},49.59,"BDI 1",{"$f":"IF($A108=\"S\",IF($Q$10=\"Preço Unitário (R$)\",PO.CustoUnitario,ROUND(PO.CustoUnitario*(1+$Z108),15-13*$X$6)),0)","v":62.74},{"$f":"IF($A108=\"S\",VTOTAL1,IF($A108=0,0,ROUND(SomaAgrup,15-13*$X$7)))","v":3243.66},"",{"$f":"IF(OR($A108=0,$A108=\"S\",$A108>CFF!$A$9),\"\",MAX(V$12:OFFSET(V108,-1,0))+1)","v":""},"SINAPI-91793",{"$f":"IF(AND(Fonte<>\"\",Código<>\"\"),MATCH(Fonte&\" \"&IF(Fonte=\"sinapi\",SUBSTITUTE(SUBSTITUTE(Código,\"/00\",\"/\"),\"/0\",\"/\"),Código),INDIRECT(\"'[Referência \"&_xlnm.Database&\".xls]Banco'!$a:$a\"),0),\"X\")","v":8733},{"$f":"IF(Import.Desoneracao=\"sim\",Referencia.Desonerado,Referencia.NaoDesonerado)","v":58.34},{"$f":"ROUND(IF(ISNUMBER(R108),R108,IF(LEFT(R108,3)=\"BDI\",HLOOKUP(R108,DADOS!$T$37:$X$38,2,FALSE),0)),15-11*$X$5)","v":0.26519999999999999}]
["S",0,1,16,0,0,3,0,0,"Serviço","1.16.3.","SINAPI","91794","INST. TUBO PVC, SÉRIE N, ESGOTO PREDIAL, DN 75 MM, INCL. CONEXÕES, CORTES E FIXAÇÕES","M",{"$f":"OFFSET(PLQ!$E$12,ROW($P109)-ROW(P$12),0)","v":8.3000000000000007},21.36,"BDI 1",27.02,224.27,"",{"$f":"IF(OR($A109=0,$A109=\"S\",$A109>CFF!$A$9),\"\",MAX(V$12:OFFSET(V109,-1,0))+1)","v":""},"SINAPI-91794",8734,{"$f":"IF(Import.Desoneracao=\"sim\",Referencia.Desonerado,Referencia.NaoDesonerado)","v":25.13},{"$f":"ROUND(IF(ISNUMBER(R109),R109,IF(LEFT(R109,3)=\"BDI\",HLOOKUP(R109,DADOS!$T$37:$X$38,2,FALSE),0)),15-11*$X$5)","v":0.26519999999999999}]
["S",0,1,16,0,0,4,0,0,"Serviço","1.16.4.","SINAPI","91795","SERVIÇO DE INST. TUBO PVC, SÉRIE N, ESGOTO PREDIAL, 100 MM, INCL. CONEXÕES E CORTES, FIXAÇÕES","M",{"$f":"OFFSET(PLQ!$E$12,ROW($P110)-ROW(P$12),0)","v":43.8},37.93,"BDI 1",47.99,2101.96,"",{"$f":"IF(OR($A110=0,$A110=\"S\",$A110>CFF!$A$9),\"\",MAX(V$12:OFFSET(V110,-1,0))+1)","v":""},"SINAPI-91795",8735,{"$f":"IF(Import.Desoneracao=\"sim\",Referencia.Desonerado,Referencia.NaoDesonerado)","v":44.62},{"$f":"ROUND(IF(ISNUMBER(R110),R110,IF(LEFT(R110,3)=\"BDI\",HLOOKUP(R110,DADOS!$T$37:$X$38,2,FALSE),0)),15-11*$X$5)","v":0.26519999999999999}]
["S",0,1,16,0,0,5,0,0,"Serviço","1.16.5.","SINAPI","91796","TUBO DE PVC, SÉRIE NORMAL, ESGOTO PREDIAL, DN 150 MM, INCLUSIVE CONEXÕES, CORTES E FIXAÇÕES","M",{"$f":"OFFSET(PLQ!$E$12,ROW($P111)-ROW(P$12),0)","v":184.83},37.130000000000003,"BDI 1",46.98,8683.31,"",{"$f":"IF(OR($A111=0,$A111=\"S\",$A111>CFF!$A$9),\"\",MAX(V$12:OFFSET(V111,-1,0))+1)","v":""},"SINAPI-91796",8736,{"$f":"IF(Import.Desoneracao=\"sim\",Referencia.Desonerado,Referencia.NaoDesonerado)","v":43.68},{"$f":"ROUND(IF(ISNUMBER(R111),R111,IF(LEFT(R111,3)=\"BDI\",HLOOKUP(R111,DADOS!$T$37:$X$38,2,FALSE),0)),15-11*$X$5)","v":0.26519999999999999}]
["S",0,1,16,0,0,6,0,0,"Serviço","1.16.6.","SANITÁRIO","1","TANQUE SÉPTICO 2,60 x 1,50m x 1,80m (CxLxA)","Unid",{"$f":"OFFSET(PLQ!$E$12,ROW($P112)-ROW(P$12),0)","v":1},1053.3399999999999,"BDI 1",1332.69,1332.69,"",{"$f":"IF(OR($A112=0,$A112=\"S\",$A112>CFF!$A$9),\"\",MAX(V$12:OFFSET(V112,-1,0))+1)","v":""},"SANITÁRIO-1",25,{"$f":"IF(Import.Desoneracao=\"sim\",Referencia.Desonerado,Referencia.NaoDesonerado)","v":1239.2199999999998},{"$f":"ROUND(IF(ISNUMBER(R112),R112,IF(LEFT(R112,3)=\"BDI\",HLOOKUP(R112,DADOS!$T$37:$X$38,2,FALSE),0)),15-11*$X$5)","v":0.26519999999999999}]
["S",0,1,16,0,0,7,0,0,"Serviço","1.16.7.","SANITÁRIO","2","SUMIDOURO 4,8 x 2,50m x 1,70m (CxLxA)","Unid",{"$f":"OFFSET(PLQ!$E$12,ROW($P113)-ROW(P$12),0)","v":1},2394.04,"BDI 1",3028.94,3028.94,"",{"$f":"IF(OR($A113=0,$A113=\"S\",$A113>CFF!$A$9),\"\",MAX(V$12:OFFSET(V113,-1,0))+1)","v":""},"SANITÁRIO-2",26,{"$f":"IF(Import.Desoneracao=\"sim\",Referencia.Desonerado,Referencia.NaoDesonerado)","v":2816.52},{"$f":"ROUND(IF(ISNUMBER(R113),R113,IF(LEFT(R113,3)=\"BDI\",HLOOKUP(R113,DADOS!$T$37:$X$38,2,FALSE),0)),15-11*$X$5)","v":0.26519999999999999}]
["S",0,1,16,0,0,8,0,0,"Serviço","1.16.8.","SINAPI","98103","CAIXA DE GORDURA DUPLA EM CONCRETO PRE-MOLDADO DN 60,0 CM COM TAMPA ","UN",{"$f":"OFFSET(PLQ!$E$12,ROW($P114)-ROW(P$12),0)","v":2},96.96,"BDI 1",122.67,245.34,"",{"$f":"IF(OR($A114=0,$A114=\"S\",$A114>CFF!$A$9),\"\",MAX(V$12:OFFSET(V114,-1,0))+1)","v":""},"SINAPI-98103",9970,{"$f":"IF(Import.Desoneracao=\"sim\",Referencia.Desonerado,Referencia.NaoDesonerado)","v":114.07},{"$f":"ROUND(IF(ISNUMBER(R114),R114,IF(LEFT(R114,3)=\"BDI\",HLOOKUP(R114,DADOS!$T$37:$X$38,2,FALSE),0)),15-11*$X$5)","v":0.26519999999999999}]
["S",0,1,16,0,0,9,0,0,"Serviço","1.16.9.","SINAPI","74166/1","CAIXA DE PASSAGEM EM CONCRETO DN 60CM X 60CM DE ALTURA COM TAMPA, COM TAMPA","UN",{"$f":"OFFSET(PLQ!$E$12,ROW($P115)-ROW(P$12),0)","v":14},147.66,"BDI 1",186.82,2615.48,"",{"$f":"IF(OR($A115=0,$A115=\"S\",$A115>CFF!$A$9),\"\",MAX(V$12:OFFSET(V115,-1,0))+1)","v":""},"SINAPI-74166/1",9956,{"$f":"IF(Import.Desoneracao=\"sim\",Referencia.Desonerado,Referencia.NaoDesonerado)","v":173.72},{"$f":"ROUND(IF(ISNUMBER(R115),R115,IF(LEFT(R115,3)=\"BDI\",HLOOKUP(R115,DADOS!$T$37:$X$38,2,FALSE),0)),15-11*$X$5)","v":0.26519999999999999}]
[{"$f":"CHOOSE(1+LOG(1+2*(J116=\"Meta\")+4*(J116=\"Nível 2\")+8*(J116=\"Nível 3\")+16*(J116=\"Nível 4\")+32*(J116=\"Serviço\"),2),0,1,2,3,4,\"S\")","v":"S"},{"$f":"IF(OR(A116=\"S\",A116=0),0,IF(ISERROR(I116),H116,SMALL(H116:I116,1)))","v":0},{"$f":"IF($A116=1,OFFSET(C116,-1,0)+1,OFFSET(C116,-1,0))","v":1},{"$f":"IF($A116=1,0,IF($A116=2,OFFSET(D116,-1,0)+1,OFFSET(D116,-1,0)))","v":16},{"$f":"IF(AND($A116<=2,$A116<>0),0,IF($A116=3,OFFSET(E116,-1,0)+1,OFFSET(E116,-1,0)))","v":0},{"$f":"IF(AND($A116<=3,$A116<>0),0,IF($A116=4,OFFSET(F116,-1,0)+1,OFFSET(F116,-1,0)))","v":0},{"$f":"IF(AND($A116<=4,$A116<>0),0,IF($A116=\"S\",OFFSET(G116,-1,0)+1,OFFSET(G116,-1,0)))","v":10},0,0,"Serviço",{"$f":"IF($A116=0,\"-\",CONCATENATE(C116&\".\",IF(AND($A$5>=2,$A116>=2),D116&\".\",\"\"),IF(AND($A$5>=3,$A116>=3),E116&\".\",\"\"),IF(AND($A$5>=4,$A116>=4),F116&\".\",\"\"),IF($A116=\"S\",G116&\".\",\"\")))","v":"1.16.10."},"SINAPI","74166/1","CAIXA DE INSPEÇÃO EM CONCRETO DN 60CM X 60CM DE ALTURA COM TAMPA, COM TAMPA","UN",{"$f":"OFFSET(PLQ!$E$12,ROW($P116)-ROW(P$12),0)","v":4},147.66,"BDI 1",{"$f":"IF($A116=\"S\",IF($Q$10=\"Preço Unitário (R$)\",PO.CustoUnitario,ROUND(PO.CustoUnitario*(1+$Z116),15-13*$X$6)),0)","v":186.82},{"$f":"IF($A116=\"S\",VTOTAL1,IF($A116=0,0,ROUND(SomaAgrup,15-13*$X$7)))","v":747.28},{"$f":"IF($J116=\"\",\"\",IF($N116=\"\",\"DESCRIÇÃO\",IF(AND($J116=\"Serviço\",$O116=\"\"),\"UNIDADE\",IF($T116<=0,\"SEM VALOR\",IF(AND($Y116<>\"\",$Q116>$Y116),\"ACIMA REF.\",\"\")))))","v":""},{"$f":"IF(OR($A116=0,$A116=\"S\",$A116>CFF!$A$9),\"\",MAX(V$12:OFFSET(V116,-1,0))+1)","v":""},{"$f":"IF(AND($J116=\"Serviço\",$M116<>\"\"),IF($L116=\"\",$M116,CONCATENATE($L116,\"-\",$M116)))","v":"SINAPI-74166/1"},{"$f":"IF(AND(Fonte<>\"\",Código<>\"\"),MATCH(Fonte&\" \"&IF(Fonte=\"sinapi\",SUBSTITUTE(SUBSTITUTE(Código,\"/00\",\"/\"),\"/0\",\"/\"),Código),INDIRECT(\"'[Referência \"&_xlnm.Database&\".xls]Banco'!$a:$a\"),0),\"X\")","v":9956},{"$f":"IF(Import.Desoneracao=\"sim\",Referencia.Desonerado,Referencia.NaoDesonerado)","v":173.72},{"$f":"ROUND(IF(ISNUMBER(R116),R116,IF(LEFT(R116,3)=\"BDI\",HLOOKUP(R116,DADOS!$T$37:$X$38,2,FALSE),0)),15-11*$X$5)","v":0.26519999999999999}]
["S",0,1,16,0,0,11,0,0,"Serviço","1.16.11.","SINAPI-I","11745","RALO SIFONADO PVC, QUADRADO, 100 X 100 X 53 MM, SAIDA 40 MM, COM GRELHA BRANCA","UN",{"$f":"OFFSET(PLQ!$E$12,ROW($P117)-ROW(P$12),0)","v":6},4.79,"BDI 1",6.06,36.36,"",{"$f":"IF(OR($A117=0,$A117=\"S\",$A117>CFF!$A$9),\"\",MAX(V$12:OFFSET(V117,-1,0))+1)","v":""},"SINAPI-I-11745",4312,{"$f":"IF(Import.Desoneracao=\"sim\",Referencia.Desonerado,Referencia.NaoDesonerado)","v":5.63},{"$f":"ROUND(IF(ISNUMBER(R117),R117,IF(LEFT(R117,3)=\"BDI\",HLOOKUP(R117,DADOS!$T$37:$X$38,2,FALSE),0)),15-11*$X$5)","v":0.26519999999999999}]
["S",0,1,16,0,0,12,0,0,"Serviço","1.16.12.","AMMOC","18","CISTERNA COM RESERVATÓRIO DE 2.000L, ENTERRADA PARA COLETAS DE AGUAS DA CHUVA E REUTILIZAÇÃO, COM BOMBA CENTRÍFUGA","Unid",{"$f":"OFFSET(PLQ!$E$12,ROW($P118)-ROW(P$12),0)","v":1},3456.64,"BDI 1",4373.34,4373.34,"",{"$f":"IF(OR($A118=0,$A118=\"S\",$A118>CFF!$A$9),\"\",MAX(V$12:OFFSET(V118,-1,0))+1)","v":""},"AMMOC-18",24,{"$f":"IF(Import.Desoneracao=\"sim\",Referencia.Desonerado,Referencia.NaoDesonerado)","v":4066.63},{"$f":"ROUND(IF(ISNUMBER(R118),R118,IF(LEFT(R118,3)=\"BDI\",HLOOKUP(R118,DADOS!$T$37:$X$38,2,FALSE),0)),15-11*$X$5)","v":0.26519999999999999}]
[2,19,1,17,0,0,0,48,19,"Nível 2","1.17.",null,null,"INSTALAÇÕES ELÉTRICAS",{"$f":"Referencia.Unidade","v":""},{"$f":"OFFSET(PLQ!$E$12,ROW($P119)-ROW(P$12),0)","v":0},0,"BDI 1",0,33940.089999999997,"",{"$f":"IF(OR($A119=0,$A119=\"S\",$A119>CFF!$A$9),\"\",MAX(V$12:OFFSET(V119,-1,0))+1)","v":18},false,"X",{"$f":"IF(Import.Desoneracao=\"sim\",Referencia.Desonerado,Referencia.NaoDesonerado)","v":0},{"$f":"ROUND(IF(ISNUMBER(R119),R119,IF(LEFT(R119,3)=\"BDI\",HLOOKUP(R119,DADOS!$T$37:$X$38,2,FALSE),0)),15-11*$X$5)","v":0.26519999999999999}]
["S",0,1,17,0,0,1,0,0,"Serviço","1.17.1.","SINAPI","41598","ENTRADA PROVISORIA DE ENERGIA ELETRICA AEREA TRIFASICA 40A EM POSTE MADEIRA","UN",{"$f":"OFFSET(PLQ!$E$12,ROW($P120)-ROW(P$12),0)","v":1},1187.8399999999999,"BDI 1",1502.86,1502.86,"",{"$f":"IF(OR($A120=0,$A120=\"S\",$A120>CFF!$A$9),\"\",MAX(V$12:OFFSET(V120,-1,0))+1)","v":""},"SINAPI-41598",8479,{"$f":"IF(Import.Desoneracao=\"sim\",Referencia.Desonerado,Referencia.NaoDesonerado)","v":1397.46},{"$f":"ROUND(IF(ISNUMBER(R120),R120,IF(LEFT(R120,3)=\"BDI\",HLOOKUP(R120,DADOS!$T$37:$X$38,2,FALSE),0)),15-11*$X$5)","v":0.26519999999999999}]
["S",0,1,17,0,0,2,0,0,"Serviço","1.17.2.","SINAPI","9540","ENTRADA DE ENERGIA ELÉTRICA AÉREA MONOFÁSICA 50A COM POSTE DE CONCRETO, INCLUSIVE CABEAMENTO, CAIXA DE PROTEÇÃO PARA MEDIDOR E ATERRAMENTO.","UN",{"$f":"OFFSET(PLQ!$E$12,ROW($P121)-ROW(P$12),0)","v":1},1014.51,"BDI 1",1283.56,1283.56,"",{"$f":"IF(OR($A121=0,$A121=\"S\",$A121>CFF!$A$9),\"\",MAX(V$12:OFFSET(V121,-1,0))+1)","v":""},"SINAPI-9540",8478,{"$f":"IF(Import.Desoneracao=\"sim\",Referencia.Desonerado,Referencia.NaoDesonerado)","v":1193.54},{"$f":"ROUND(IF(ISNUMBER(R121),R121,IF(LEFT(R121,3)=\"BDI\",HLOOKUP(R121,DADOS!$T$37:$X$38,2,FALSE),0)),15-11*$X$5)","v":0.26519999999999999}]
["S",0,1,17,0,0,3,0,0,"Serviço","1.17.3.","SINAPI","74131/005","QUADRO DE DISTRIBUICAO DE ENERGIA DE EMBUTIR, EM CHAPA METALICA, PARA 24 DISJUNTORES TERMOMAGNETICOS MONOPOLARES, COM BARRAMENTO TRIFASICO E NEUTRO, FORNECIMENTO E INSTALACAO","UN",{"$f":"OFFSET(PLQ!$E$12,ROW($P122)-ROW(P$12),0)","v":1},440.65,"BDI 1",557.51,557.51,"",{"$f":"IF(OR($A122=0,$A122=\"S\",$A122>CFF!$A$9),\"\",MAX(V$12:OFFSET(V122,-1,0))+1)","v":""},"SINAPI-74131/005",8317,{"$f":"IF(Import.Desoneracao=\"sim\",Referencia.Desonerado,Referencia.NaoDesonerado)","v":518.41},{"$f":"ROUND(IF(ISNUMBER(R122),R122,IF(LEFT(R122,3)=\"BDI\",HLOOKUP(R122,DADOS!$T$37:$X$38,2,FALSE),0)),15-11*$X$5)","v":0.26519999999999999}]
["S",0,1,17,0,0,4,0,0,"Serviço","1.17.4.","SINAPI","74130/5","DISJUNTOR TERMOMAGNETICO TRIPOLAR PADRAO NEMA (AMERICANO) 60 A 100A 240V, FORNECIMENTO E INSTALACAO","UN",{"$f":"OFFSET(PLQ!$E$12,ROW($P123)-ROW(P$12),0)","v":1},127.53,"BDI 1",161.35,161.35,"",{"$f":"IF(OR($A123=0,$A123=\"S\",$A123>CFF!$A$9),\"\",MAX(V$12:OFFSET(V123,-1,0))+1)","v":""},"SINAPI-74130/5",8309,{"$f":"IF(Import.Desoneracao=\"sim\",Referencia.Desonerado,Referencia.NaoDesonerado)","v":150.03},{"$f":"ROUND(IF(ISNUMBER(R123),R123,IF(LEFT(R123,3)=\"BDI\",HLOOKUP(R123,DADOS!$T$37:$X$38,2,FALSE),0)),15-11*$X$5)","v":0.26519999999999999}]
["S",0,1,17,0,0,5,0,0,"Serviço","1.17.5.","SINAPI","93653","DISJUNTOR MONOPOLAR TIPO DIN, CORRENTE NOMINAL DE 10A - FORNECIMENTO E INSTALAÇÃ","UN",{"$f":"OFFSET(PLQ!$E$12,ROW($P124)-ROW(P$12),0)","v":21},10.93,"BDI 1",13.83,290.43,"",{"$f":"IF(OR($A124=0,$A124=\"S\",$A124>CFF!$A$9),\"\",MAX(V$12:OFFSET(V124,-1,0))+1)","v":""},"SINAPI-93653",8323,{"$f":"IF(Import.Desoneracao=\"sim\",Referencia.Desonerado,Referencia.NaoDesonerado)","v":12.86},{"$f":"ROUND(IF(ISNUMBER(R124),R124,IF(LEFT(R124,3)=\"BDI\",HLOOKUP(R124,DADOS!$T$37:$X$38,2,FALSE),0)),15-11*$X$5)","v":0.26519999999999999}]
["S",0,1,17,0,0,6,0,0,"Serviço","1.17.6.","SINAPI","93654","DISJUNTOR MONOPOLAR TIPO DIN, CORRENTE NOMINAL DE 16A - FORNECIMENTO E INSTALAÇÃO","UN",{"$f":"OFFSET(PLQ!$E$12,ROW($P125)-ROW(P$12),0)","v":7},11.42,"BDI 1",14.45,101.15,"",{"$f":"IF(OR($A125=0,$A125=\"S\",$A125>CFF!$A$9),\"\",MAX(V$12:OFFSET(V125,-1,0))+1)","v":""},"SINAPI-93654",8324,{"$f":"IF(Import.Desoneracao=\"sim\",Referencia.Desonerado,Referencia.NaoDesonerado)","v":13.43},{"$f":"ROUND(IF(ISNUMBER(R125),R125,IF(LEFT(R125,3)=\"BDI\",HLOOKUP(R125,DADOS!$T$37:$X$38,2,FALSE),0)),15-11*$X$5)","v":0.26519999999999999}]
["S",0,1,17,0,0,7,0,0,"Serviço","1.17.7.","SINAPI","93659","DISJUNTOR MONOPOLAR TIPO DIN, CORRENTE NOMINAL DE 50A - FORNECIMENTO E INSTALAÇÃO","UN",{"$f":"OFFSET(PLQ!$E$12,ROW($P126)-ROW(P$12),0)","v":2},21.56,"BDI 1",27.28,54.56,"",{"$f":"IF(OR($A126=0,$A126=\"S\",$A126>CFF!$A$9),\"\",MAX(V$12:OFFSET(V126,-1,0))+1)","v":""},"SINAPI-93659",8329,{"$f":"IF(Import.Desoneracao=\"sim\",Referencia.Desonerado,Referencia.NaoDesonerado)","v":25.37},{"$f":"ROUND(IF(ISNUMBER(R126),R126,IF(LEFT(R126,3)=\"BDI\",HLOOKUP(R126,DADOS!$T$37:$X$38,2,FALSE),0)),15-11*$X$5)","v":0.26519999999999999}]
["S",0,1,17,0,0,8,0,0,"Serviço","1.17.8.","SINAPI","93128","PONTO DE ILUMINAÇÃO RESIDENCIAL INCLUINDO INTERRUPTOR SIMPLES, CAIXA ELÉTRICA, ELETRODUTO, CABO, RASGO, QUEBRA E CHUMBAMENTO","UN",{"$f":"OFFSET(PLQ!$E$12,ROW($P127)-ROW(P$12),0)","v":6},99.42,"BDI 1",125.79,754.74,"",{"$f":"IF(OR($A127=0,$A127=\"S\",$A127>CFF!$A$9),\"\",MAX(V$12:OFFSET(V127,-1,0))+1)","v":""},"SINAPI-93128",8552,{"$f":"IF(Import.Desoneracao=\"sim\",Referencia.Desonerado,Referencia.NaoDesonerado)","v":116.97},{"$f":"ROUND(IF(ISNUMBER(R127),R127,IF(LEFT(R127,3)=\"BDI\",HLOOKUP(R127,DADOS!$T$37:$X$38,2,FALSE),0)),15-11*$X$5)","v":0.26519999999999999}]
[{"$f":"CHOOSE(1+LOG(1+2*(J128=\"Meta\")+4*(J128=\"Nível 2\")+8*(J128=\"Nível 3\")+16*(J128=\"Nível 4\")+32*(J128=\"Serviço\"),2),0,1,2,3,4,\"S\")","v":"S"},{"$f":"IF(OR(A128=\"S\",A128=0),0,IF(ISERROR(I128),H128,SMALL(H128:I128,1)))","v":0},{"$f":"IF($A128=1,OFFSET(C128,-1,0)+1,OFFSET(C128,-1,0))","v":1},{"$f":"IF($A128=1,0,IF($A128=2,OFFSET(D128,-1,0)+1,OFFSET(D128,-1,0)))","v":17},{"$f":"IF(AND($A128<=2,$A128<>0),0,IF($A128=3,OFFSET(E128,-1,0)+1,OFFSET(E128,-1,0)))","v":0},{"$f":"IF(AND($A128<=3,$A128<>0),0,IF($A128=4,OFFSET(F128,-1,0)+1,OFFSET(F128,-1,0)))","v":0},{"$f":"IF(AND($A128<=4,$A128<>0),0,IF($A128=\"S\",OFFSET(G128,-1,0)+1,OFFSET(G128,-1,0)))","v":9},0,0,"Serviço",{"$f":"IF($A128=0,\"-\",CONCATENATE(C128&\".\",IF(AND($A$5>=2,$A128>=2),D128&\".\",\"\"),IF(AND($A$5>=3,$A128>=3),E128&\".\",\"\"),IF(AND($A$5>=4,$A128>=4),F128&\".\",\"\"),IF($A128=\"S\",G128&\".\",\"\")))","v":"1.17.9."},"SINAPI","93137","PONTO DE ILUMINAÇÃO RESIDENCIAL INCLUINDO INTERRUPTOR SIMPLES (2 MÓDULOS), CAIXA ELÉTRICA, ELETRODUTO, CABO, RASGO, QUEBRA E CHUMBAMENTO ","UN",{"$f":"OFFSET(PLQ!$E$12,ROW($P128)-ROW(P$12),0)","v":9},117.27,"BDI 1",{"$f":"IF($A128=\"S\",IF($Q$10=\"Preço Unitário (R$)\",PO.CustoUnitario,ROUND(PO.CustoUnitario*(1+$Z128),15-13*$X$6)),0)","v":148.37},{"$f":"IF($A128=\"S\",VTOTAL1,IF($A128=0,0,ROUND(SomaAgrup,15-13*$X$7)))","v":1335.33},{"$f":"IF($J128=\"\",\"\",IF($N128=\"\",\"DESCRIÇÃO\",IF(AND($J128=\"Serviço\",$O128=\"\"),\"UNIDADE\",IF($T128<=0,\"SEM VALOR\",IF(AND($Y128<>\"\",$Q128>$Y128),\"ACIMA REF.\",\"\")))))","v":""},{"$f":"IF(OR($A128=0,$A128=\"S\",$A128>CFF!$A$9),\"\",MAX(V$12:OFFSET(V128,-1,0))+1)","v":""},{"$f":"IF(AND($J128=\"Serviço\",$M128<>\"\"),IF($L128=\"\",$M128,CONCATENATE($L128,\"-\",$M128)))","v":"SINAPI-93137"},{"$f":"IF(AND(Fonte<>\"\",Código<>\"\"),MATCH(Fonte&\" \"&IF(Fonte=\"sinapi\",SUBSTITUTE(SUBSTITUTE(Código,\"/00\",\"/\"),\"/0\",\"/\"),Código),INDIRECT(\"'[Referência \"&_xlnm.Database&\".xls]Banco'!$a:$a\"),0),\"X\")","v":8553},{"$f":"IF(Import.Desoneracao=\"sim\",Referencia.Desonerado,Referencia.NaoDesonerado)","v":137.96},{"$f":"ROUND(IF(ISNUMBER(R128),R128,IF(LEFT(R128,3)=\"BDI\",HLOOKUP(R128,DADOS!$T$37:$X$38,2,FALSE),0)),15-11*$X$5)","v":0.26519999999999999}]
[{"$f":"CHOOSE(1+LOG(1+2*(J129=\"Meta\")+4*(J129=\"Nível 2\")+8*(J129=\"Nível 3\")+16*(J129=\"Nível 4\")+32*(J129=\"Serviço\"),2),0,1,2,3,4,\"S\")","v":"S"},{"$f":"IF(OR(A129=\"S\",A129=0),0,IF(ISERROR(I129),H129,SMALL(H129:I129,1)))","v":0},{"$f":"IF($A129=1,OFFSET(C129,-1,0)+1,OFFSET(C129,-1,0))","v":1},{"$f":"IF($A129=1,0,IF($A129=2,OFFSET(D129,-1,0)+1,OFFSET(D129,-1,0)))","v":17},{"$f":"IF(AND($A129<=2,$A129<>0),0,IF($A129=3,OFFSET(E129,-1,0)+1,OFFSET(E129,-1,0)))","v":0},{"$f":"IF(AND($A129<=3,$A129<>0),0,IF($A129=4,OFFSET(F129,-1,0)+1,OFFSET(F129,-1,0)))","v":0},{"$f":"IF(AND($A129<=4,$A129<>0),0,IF($A129=\"S\",OFFSET(G129,-1,0)+1,OFFSET(G129,-1,0)))","v":10},0,0,"Serviço",{"$f":"IF($A129=0,\"-\",CONCATENATE(C129&\".\",IF(AND($A$5>=2,$A129>=2),D129&\".\",\"\"),IF(AND($A$5>=3,$A129>=3),E129&\".\",\"\"),IF(AND($A$5>=4,$A129>=4),F129&\".\",\"\"),IF($A129=\"S\",G129&\".\",\"\")))","v":"1.17.10."},"SINAPI","93138","PONTO DE ILUMINAÇÃO RESIDENCIAL INCLUINDO INTERRUPTOR PARALELO, CAIXA ELÉTRICA, ELETRODUTO, CABO, RASGO, QUEBRA E CHUMBAMENTO ","UN",{"$f":"OFFSET(PLQ!$E$12,ROW($P129)-ROW(P$12),0)","v":8},110.68,"BDI 1",{"$f":"IF($A129=\"S\",IF($Q$10=\"Preço Unitário (R$)\",PO.CustoUnitario,ROUND(PO.CustoUnitario*(1+$Z129),15-13*$X$6)),0)","v":140.03},{"$f":"IF($A129=\"S\",VTOTAL1,IF($A129=0,0,ROUND(SomaAgrup,15-13*$X$7)))","v":1120.24},{"$f":"IF($J129=\"\",\"\",IF($N129=\"\",\"DESCRIÇÃO\",IF(AND($J129=\"Serviço\",$O129=\"\"),\"UNIDADE\",IF($T129<=0,\"SEM VALOR\",IF(AND($Y129<>\"\",$Q129>$Y129),\"ACIMA REF.\",\"\")))))","v":""},{"$f":"IF(OR($A129=0,$A129=\"S\",$A129>CFF!$A$9),\"\",MAX(V$12:OFFSET(V129,-1,0))+1)","v":""},{"$f":"IF(AND($J129=\"Serviço\",$M129<>\"\"),IF($L129=\"\",$M129,CONCATENATE($L129,\"-\",$M129)))","v":"SINAPI-93138"},{"$f":"IF(AND(Fonte<>\"\",Código<>\"\"),MATCH(Fonte&\" \"&IF(Fonte=\"sinapi\",SUBSTITUTE(SUBSTITUTE(Código,\"/00\",\"/\"),\"/0\",\"/\"),Código),INDIRECT(\"'[Referência \"&_xlnm.Database&\".xls]Banco'!$a:$a\"),0),\"X\")","v":8554},{"$f":"IF(Import.Desoneracao=\"sim\",Referencia.Desonerado,Referencia.NaoDesonerado)","v":130.21},{"$f":"ROUND(IF(ISNUMBER(R129),R129,IF(LEFT(R129,3)=\"BDI\",HLOOKUP(R129,DADOS!$T$37:$X$38,2,FALSE),0)),15-11*$X$5)","v":0.26519999999999999}]
[{"$f":"CHOOSE(1+LOG(1+2*(J130=\"Meta\")+4*(J130=\"Nível 2\")+8*(J130=\"Nível 3\")+16*(J130=\"Nível 4\")+32*(J130=\"Serviço\"),2),0,1,2,3,4,\"S\")","v":"S"},{"$f":"IF(OR(A130=\"S\",A130=0),0,IF(ISERROR(I130),H130,SMALL(H130:I130,1)))","v":0},{"$f":"IF($A130=1,OFFSET(C130,-1,0)+1,OFFSET(C130,-1,0))","v":1},{"$f":"IF($A130=1,0,IF($A130=2,OFFSET(D130,-1,0)+1,OFFSET(D130,-1,0)))","v":17},{"$f":"IF(AND($A130<=2,$A130<>0),0,IF($A130=3,OFFSET(E130,-1,0)+1,OFFSET(E130,-1,0)))","v":0},{"$f":"IF(AND($A130<=3,$A130<>0),0,IF($A130=4,OFFSET(F130,-1,0)+1,OFFSET(F130,-1,0)))","v":0},{"$f":"IF(AND($A130<=4,$A130<>0),0,IF($A130=\"S\",OFFSET(G130,-1,0)+1,OFFSET(G130,-1,0)))","v":11},0,0,"Serviço",{"$f":"IF($A130=0,\"-\",CONCATENATE(C130&\".\",IF(AND($A$5>=2,$A130>=2),D130&\".\",\"\"),IF(AND($A$5>=3,$A130>=3),E130&\".\",\"\"),IF(AND($A$5>=4,$A130>=4),F130&\".\",\"\"),IF($A130=\"S\",G130&\".\",\"\")))","v":"1.17.11."},"SINAPI","93139","PONTO DE ILUMINAÇÃO RESIDENCIAL INCLUINDO INTERRUPTOR PARALELO (2 MÓDULOS), CAIXA ELÉTRICA, ELETRODUTO, CABO, RASGO, QUEBRA E CHUMBAMENTO ","UN",{"$f":"OFFSET(PLQ!$E$12,ROW($P130)-ROW(P$12),0)","v":4},139.75,"BDI 1",{"$f":"IF($A130=\"S\",IF($Q$10=\"Preço Unitário (R$)\",PO.CustoUnitario,ROUND(PO.CustoUnitario*(1+$Z130),15-13*$X$6)),0)","v":176.81},{"$f":"IF($A130=\"S\",VTOTAL1,IF($A130=0,0,ROUND(SomaAgrup,15-13*$X$7)))","v":707.24},{"$f":"IF($J130=\"\",\"\",IF($N130=\"\",\"DESCRIÇÃO\",IF(AND($J130=\"Serviço\",$O130=\"\"),\"UNIDADE\",IF($T130<=0,\"SEM VALOR\",IF(AND($Y130<>\"\",$Q130>$Y130),\"ACIMA REF.\",\"\")))))","v":""},{"$f":"IF(OR($A130=0,$A130=\"S\",$A130>CFF!$A$9),\"\",MAX(V$12:OFFSET(V130,-1,0))+1)","v":""},{"$f":"IF(AND($J130=\"Serviço\",$M130<>\"\"),IF($L130=\"\",$M130,CONCATENATE($L130,\"-\",$M130)))","v":"SINAPI-93139"},{"$f":"IF(AND(Fonte<>\"\",Código<>\"\"),MATCH(Fonte&\" \"&IF(Fonte=\"sinapi\",SUBSTITUTE(SUBSTITUTE(Código,\"/00\",\"/\"),\"/0\",\"/\"),Código),INDIRECT(\"'[Referência \"&_xlnm.Database&\".xls]Banco'!$a:$a\"),0),\"X\")","v":8555},{"$f":"IF(Import.Desoneracao=\"sim\",Referencia.Desonerado,Referencia.NaoDesonerado)","v":164.41},{"$f":"ROUND(IF(ISNUMBER(R130),R130,IF(LEFT(R130,3)=\"BDI\",HLOOKUP(R130,DADOS!$T$37:$X$38,2,FALSE),0)),15-11*$X$5)","v":0.26519999999999999}]
["S",0,1,17,0,0,12,0,0,"Serviço","1.17.12.","SINAPI","93141","PONTO DE TOMADA RESIDENCIAL INCLUINDO TOMADA 10A/250V, CAIXA ELÉTRICA, ELETRODUTO, CABO, RASGO, QUEBRA E CHUMBAMENTO","UN",{"$f":"OFFSET(PLQ!$E$12,ROW($P131)-ROW(P$12),0)","v":106},118.1,"BDI 1",149.41999999999999,15838.52,"",{"$f":"IF(OR($A131=0,$A131=\"S\",$A131>CFF!$A$9),\"\",MAX(V$12:OFFSET(V131,-1,0))+1)","v":""},"SINAPI-93141",8557,{"$f":"IF(Import.Desoneracao=\"sim\",Referencia.Desonerado,Referencia.NaoDesonerado)","v":138.94},{"$f":"ROUND(IF(ISNUMBER(R131),R131,IF(LEFT(R131,3)=\"BDI\",HLOOKUP(R131,DADOS!$T$37:$X$38,2,FALSE),0)),15-11*$X$5)","v":0.26519999999999999}]
["S",0,1,17,0,0,13,0,0,"Serviço","1.17.13.","SINAPI","93143","PONTO DE TOMADA RESIDENCIAL INCLUINDO TOMADA 20A/250V, CAIXA ELÉTRICA, ELETRODUTO, CABO, RASGO, QUEBRA E CHUMBAMENTO","UN",{"$f":"OFFSET(PLQ!$E$12,ROW($P132)-ROW(P$12),0)","v":10},119.7,"BDI 1",151.44,1514.4,"",{"$f":"IF(OR($A132=0,$A132=\"S\",$A132>CFF!$A$9),\"\",MAX(V$12:OFFSET(V132,-1,0))+1)","v":""},"SINAPI-93143",8559,{"$f":"IF(Import.Desoneracao=\"sim\",Referencia.Desonerado,Referencia.NaoDesonerado)","v":140.82},{"$f":"ROUND(IF(ISNUMBER(R132),R132,IF(LEFT(R132,3)=\"BDI\",HLOOKUP(R132,DADOS!$T$37:$X$38,2,FALSE),0)),15-11*$X$5)","v":0.26519999999999999}]
["S",0,1,17,0,0,14,0,0,"Serviço","1.17.14.","SINAPI-I","39385","LUMINARIA LED PLAFON REDONDO DE SOBREPOR BIVOLT 12/13 W,  D = *17* CM","UN",{"$f":"OFFSET(PLQ!$E$12,ROW($P133)-ROW(P$12),0)","v":13},63.21,"BDI 1",79.97,1039.6099999999999,"",{"$f":"IF(OR($A133=0,$A133=\"S\",$A133>CFF!$A$9),\"\",MAX(V$12:OFFSET(V133,-1,0))+1)","v":""},"SINAPI-I-39385",3230,{"$f":"IF(Import.Desoneracao=\"sim\",Referencia.Desonerado,Referencia.NaoDesonerado)","v":74.37},{"$f":"ROUND(IF(ISNUMBER(R133),R133,IF(LEFT(R133,3)=\"BDI\",HLOOKUP(R133,DADOS!$T$37:$X$38,2,FALSE),0)),15-11*$X$5)","v":0.26519999999999999}]
[{"$f":"CHOOSE(1+LOG(1+2*(J134=\"Meta\")+4*(J134=\"Nível 2\")+8*(J134=\"Nível 3\")+16*(J134=\"Nível 4\")+32*(J134=\"Serviço\"),2),0,1,2,3,4,\"S\")","v":"S"},{"$f":"IF(OR(A134=\"S\",A134=0),0,IF(ISERROR(I134),H134,SMALL(H134:I134,1)))","v":0},{"$f":"IF($A134=1,OFFSET(C134,-1,0)+1,OFFSET(C134,-1,0))","v":1},{"$f":"IF($A134=1,0,IF($A134=2,OFFSET(D134,-1,0)+1,OFFSET(D134,-1,0)))","v":17},{"$f":"IF(AND($A134<=2,$A134<>0),0,IF($A134=3,OFFSET(E134,-1,0)+1,OFFSET(E134,-1,0)))","v":0},{"$f":"IF(AND($A134<=3,$A134<>0),0,IF($A134=4,OFFSET(F134,-1,0)+1,OFFSET(F134,-1,0)))","v":0},{"$f":"IF(AND($A134<=4,$A134<>0),0,IF($A134=\"S\",OFFSET(G134,-1,0)+1,OFFSET(G134,-1,0)))","v":15},0,0,"Serviço",{"$f":"IF($A134=0,\"-\",CONCATENATE(C134&\".\",IF(AND($A$5>=2,$A134>=2),D134&\".\",\"\"),IF(AND($A$5>=3,$A134>=3),E134&\".\",\"\"),IF(AND($A$5>=4,$A134>=4),F134&\".\",\"\"),IF($A134=\"S\",G134&\".\",\"\")))","v":"1.17.15."},"SINAPI","97610","LÂMPADA COMPACTA DE LED 10 W, BASE E27 - FORNECIMENTO E INSTALAÇÃO","UN",{"$f":"OFFSET(PLQ!$E$12,ROW($P134)-ROW(P$12),0)","v":13},33.15,"BDI 1",{"$f":"IF($A134=\"S\",IF($Q$10=\"Preço Unitário (R$)\",PO.CustoUnitario,ROUND(PO.CustoUnitario*(1+$Z134),15-13*$X$6)),0)","v":41.94},{"$f":"IF($A134=\"S\",VTOTAL1,IF($A134=0,0,ROUND(SomaAgrup,15-13*$X$7)))","v":545.22},{"$f":"IF($J134=\"\",\"\",IF($N134=\"\",\"DESCRIÇÃO\",IF(AND($J134=\"Serviço\",$O134=\"\"),\"UNIDADE\",IF($T134<=0,\"SEM VALOR\",IF(AND($Y134<>\"\",$Q134>$Y134),\"ACIMA REF.\",\"\")))))","v":""},{"$f":"IF(OR($A134=0,$A134=\"S\",$A134>CFF!$A$9),\"\",MAX(V$12:OFFSET(V134,-1,0))+1)","v":""},{"$f":"IF(AND($J134=\"Serviço\",$M134<>\"\"),IF($L134=\"\",$M134,CONCATENATE($L134,\"-\",$M134)))","v":"SINAPI-97610"},{"$f":"IF(AND(Fonte<>\"\",Código<>\"\"),MATCH(Fonte&\" \"&IF(Fonte=\"sinapi\",SUBSTITUTE(SUBSTITUTE(Código,\"/00\",\"/\"),\"/0\",\"/\"),Código),INDIRECT(\"'[Referência \"&_xlnm.Database&\".xls]Banco'!$a:$a\"),0),\"X\")","v":8469},{"$f":"IF(Import.Desoneracao=\"sim\",Referencia.Desonerado,Referencia.NaoDesonerado)","v":39},{"$f":"ROUND(IF(ISNUMBER(R134),R134,IF(LEFT(R134,3)=\"BDI\",HLOOKUP(R134,DADOS!$T$37:$X$38,2,FALSE),0)),15-11*$X$5)","v":0.26519999999999999}]
["S",0,1,17,0,0,16,0,0,"Serviço","1.17.16.","SINAPI","97592","LUMINÁRIA TIPO PLAFON, DE SOBREPOR, COM 1 LÂMPADA LED - FORNECIMENTO E INSTALAÇÃO","UN",{"$f":"OFFSET(PLQ!$E$12,ROW($P135)-ROW(P$12),0)","v":53},82.74,"BDI 1",104.68,5548.04,"",{"$f":"IF(OR($A135=0,$A135=\"S\",$A135>CFF!$A$9),\"\",MAX(V$12:OFFSET(V135,-1,0))+1)","v":""},"SINAPI-97592",8460,{"$f":"IF(Import.Desoneracao=\"sim\",Referencia.Desonerado,Referencia.NaoDesonerado)","v":97.34},{"$f":"ROUND(IF(ISNUMBER(R135),R135,IF(LEFT(R135,3)=\"BDI\",HLOOKUP(R135,DADOS!$T$37:$X$38,2,FALSE),0)),15-11*$X$5)","v":0.26519999999999999}]
[{"$f":"CHOOSE(1+LOG(1+2*(J136=\"Meta\")+4*(J136=\"Nível 2\")+8*(J136=\"Nível 3\")+16*(J136=\"Nível 4\")+32*(J136=\"Serviço\"),2),0,1,2,3,4,\"S\")","v":"S"},{"$f":"IF(OR(A136=\"S\",A136=0),0,IF(ISERROR(I136),H136,SMALL(H136:I136,1)))","v":0},{"$f":"IF($A136=1,OFFSET(C136,-1,0)+1,OFFSET(C136,-1,0))","v":1},{"$f":"IF($A136=1,0,IF($A136=2,OFFSET(D136,-1,0)+1,OFFSET(D136,-1,0)))","v":17},{"$f":"IF(AND($A136<=2,$A136<>0),0,IF($A136=3,OFFSET(E136,-1,0)+1,OFFSET(E136,-1,0)))","v":0},{"$f":"IF(AND($A136<=3,$A136<>0),0,IF($A136=4,OFFSET(F136,-1,0)+1,OFFSET(F136,-1,0)))","v":0},{"$f":"IF(AND($A136<=4,$A136<>0),0,IF($A136=\"S\",OFFSET(G136,-1,0)+1,OFFSET(G136,-1,0)))","v":17},0,0,"Serviço",{"$f":"IF($A136=0,\"-\",CONCATENATE(C136&\".\",IF(AND($A$5>=2,$A136>=2),D136&\".\",\"\"),IF(AND($A$5>=3,$A136>=3),E136&\".\",\"\"),IF(AND($A$5>=4,$A136>=4),F136&\".\",\"\"),IF($A136=\"S\",G136&\".\",\"\")))","v":"1.17.17."},"SINAPI-I","12062","ELETRODUTO FLEXIVEL, EM ACO, TIPO CONDUITE, DIAMETRO DE 3\"","M",{"$f":"OFFSET(PLQ!$E$12,ROW($P136)-ROW(P$12),0)","v":21.6},54.82,"BDI 1",{"$f":"IF($A136=\"S\",IF($Q$10=\"Preço Unitário (R$)\",PO.CustoUnitario,ROUND(PO.CustoUnitario*(1+$Z136),15-13*$X$6)),0)","v":69.36},{"$f":"IF($A136=\"S\",VTOTAL1,IF($A136=0,0,ROUND(SomaAgrup,15-13*$X$7)))","v":1498.18},{"$f":"IF($J136=\"\",\"\",IF($N136=\"\",\"DESCRIÇÃO\",IF(AND($J136=\"Serviço\",$O136=\"\"),\"UNIDADE\",IF($T136<=0,\"SEM VALOR\",IF(AND($Y136<>\"\",$Q136>$Y136),\"ACIMA REF.\",\"\")))))","v":""},{"$f":"IF(OR($A136=0,$A136=\"S\",$A136>CFF!$A$9),\"\",MAX(V$12:OFFSET(V136,-1,0))+1)","v":""},{"$f":"IF(AND($J136=\"Serviço\",$M136<>\"\"),IF($L136=\"\",$M136,CONCATENATE($L136,\"-\",$M136)))","v":"SINAPI-I-12062"},{"$f":"IF(AND(Fonte<>\"\",Código<>\"\"),MATCH(Fonte&\" \"&IF(Fonte=\"sinapi\",SUBSTITUTE(SUBSTITUTE(Código,\"/00\",\"/\"),\"/0\",\"/\"),Código),INDIRECT(\"'[Referência \"&_xlnm.Database&\".xls]Banco'!$a:$a\"),0),\"X\")","v":2346},{"$f":"IF(Import.Desoneracao=\"sim\",Referencia.Desonerado,Referencia.NaoDesonerado)","v":64.489999999999995},{"$f":"ROUND(IF(ISNUMBER(R136),R136,IF(LEFT(R136,3)=\"BDI\",HLOOKUP(R136,DADOS!$T$37:$X$38,2,FALSE),0)),15-11*$X$5)","v":0.26519999999999999}]
["S",0,1,17,0,0,18,0,0,"Serviço","1.17.18.","SINAPI-I","3380","HASTE DE ATERRAMENTO EM ACO COM 3,00 M DE COMPRIMENTO E DN = 5/8\", REVESTIDA COM BAIXA CAMADA DE COBRE, COM CONECTOR TIPO GRAMPO","UN",{"$f":"OFFSET(PLQ!$E$12,ROW($P137)-ROW(P$12),0)","v":3},22.96,"BDI 1",29.05,87.15,"",{"$f":"IF(OR($A137=0,$A137=\"S\",$A137>CFF!$A$9),\"\",MAX(V$12:OFFSET(V137,-1,0))+1)","v":""},"SINAPI-I-3380",332,{"$f":"IF(Import.Desoneracao=\"sim\",Referencia.Desonerado,Referencia.NaoDesonerado)","v":27.01},{"$f":"ROUND(IF(ISNUMBER(R137),R137,IF(LEFT(R137,3)=\"BDI\",HLOOKUP(R137,DADOS!$T$37:$X$38,2,FALSE),0)),15-11*$X$5)","v":0.26519999999999999}]
[2,8,1,18,0,0,0,29,8,"Nível 2","1.18.",null,null,"ENTORNO E APARELHOS",{"$f":"Referencia.Unidade","v":""},{"$f":"OFFSET(PLQ!$E$12,ROW($P138)-ROW(P$12),0)","v":0},0,"BDI 1",0,67477.649999999994,"",{"$f":"IF(OR($A138=0,$A138=\"S\",$A138>CFF!$A$9),\"\",MAX(V$12:OFFSET(V138,-1,0))+1)","v":19},false,"X",{"$f":"IF(Import.Desoneracao=\"sim\",Referencia.Desonerado,Referencia.NaoDesonerado)","v":0},{"$f":"ROUND(IF(ISNUMBER(R138),R138,IF(LEFT(R138,3)=\"BDI\",HLOOKUP(R138,DADOS!$T$37:$X$38,2,FALSE),0)),15-11*$X$5)","v":0.26519999999999999}]
["S",0,1,18,0,0,1,{"$f":"IF(OR($A139=\"S\",$A139=0),0,MATCH(0,OFFSET($B139,1,$A139,ROW($A$167)-ROW($A139)),0))","v":0},{"$f":"IF(OR($A139=\"S\",$A139=0),0,MATCH(OFFSET($B139,0,$A139)+1,OFFSET($B139,1,$A139,ROW($A$167)-ROW($A139)),0))","v":0},"Serviço","1.18.1.","COTAÇÃO","27 AMMOC","ELEVADOR DE USO RESTRITO, CAPACIDADE DE CARGA 225 KG OU MAIOR, 3 PESSOAS, ACABAMENTO AÇO INÓX ESCOVADO, EM ACORDO COM A NBR 12.892 E ITENS DE ACESSIBILIDADE","UN",{"$f":"OFFSET(PLQ!$E$12,ROW($P139)-ROW(P$12),0)","v":1},59380,"BDI 2",59380,59380,"",{"$f":"IF(OR($A139=0,$A139=\"S\",$A139>CFF!$A$9),\"\",MAX(V$12:OFFSET(V139,-1,0))+1)","v":""},"COTAÇÃO-27 AMMOC",81,{"$f":"IF(Import.Desoneracao=\"sim\",Referencia.Desonerado,Referencia.NaoDesonerado)","v":59380},{"$f":"ROUND(IF(ISNUMBER(R139),R139,IF(LEFT(R139,3)=\"BDI\",HLOOKUP(R139,DADOS!$T$37:$X$38,2,FALSE),0)),15-11*$X$5)","v":0}]
[{"$f":"CHOOSE(1+LOG(1+2*(J140=\"Meta\")+4*(J140=\"Nível 2\")+8*(J140=\"Nível 3\")+16*(J140=\"Nível 4\")+32*(J140=\"Serviço\"),2),0,1,2,3,4,\"S\")","v":"S"},{"$f":"IF(OR(A140=\"S\",A140=0),0,IF(ISERROR(I140),H140,SMALL(H140:I140,1)))","v":0},{"$f":"IF($A140=1,OFFSET(C140,-1,0)+1,OFFSET(C140,-1,0))","v":1},{"$f":"IF($A140=1,0,IF($A140=2,OFFSET(D140,-1,0)+1,OFFSET(D140,-1,0)))","v":18},{"$f":"IF(AND($A140<=2,$A140<>0),0,IF($A140=3,OFFSET(E140,-1,0)+1,OFFSET(E140,-1,0)))","v":0},{"$f":"IF(AND($A140<=3,$A140<>0),0,IF($A140=4,OFFSET(F140,-1,0)+1,OFFSET(F140,-1,0)))","v":0},{"$f":"IF(AND($A140<=4,$A140<>0),0,IF($A140=\"S\",OFFSET(G140,-1,0)+1,OFFSET(G140,-1,0)))","v":2},0,0,"Serviço",{"$f":"IF($A140=0,\"-\",CONCATENATE(C140&\".\",IF(AND($A$5>=2,$A140>=2),D140&\".\",\"\"),IF(AND($A$5>=3,$A140>=3),E140&\".\",\"\"),IF(AND($A$5>=4,$A140>=4),F140&\".\",\"\"),IF($A140=\"S\",G140&\".\",\"\")))","v":"1.18.2."},"SINAPI","68053","FORNECIMENTO/INSTALACAO LONA PLASTICA PRETA, PARA IMPERMEABILIZACAO, ESPESSURA 150 MICRAS.","M2",{"$f":"OFFSET(PLQ!$E$12,ROW($P140)-ROW(P$12),0)","v":113.9},2,"BDI 1",2.5299999999999998,288.17,{"$f":"IF($J140=\"\",\"\",IF($N140=\"\",\"DESCRIÇÃO\",IF(AND($J140=\"Serviço\",$O140=\"\"),\"UNIDADE\",IF($T140<=0,\"SEM VALOR\",IF(AND($Y140<>\"\",$Q140>$Y140),\"ACIMA REF.\",\"\")))))","v":""},{"$f":"IF(OR($A140=0,$A140=\"S\",$A140>CFF!$A$9),\"\",MAX(V$12:OFFSET(V140,-1,0))+1)","v":""},{"$f":"IF(AND($J140=\"Serviço\",$M140<>\"\"),IF($L140=\"\",$M140,CONCATENATE($L140,\"-\",$M140)))","v":"SINAPI-68053"},8056,{"$f":"IF(Import.Desoneracao=\"sim\",Referencia.Desonerado,Referencia.NaoDesonerado)","v":4.54},{"$f":"ROUND(IF(ISNUMBER(R140),R140,IF(LEFT(R140,3)=\"BDI\",HLOOKUP(R140,DADOS!$T$37:$X$38,2,FALSE),0)),15-11*$X$5)","v":0.26519999999999999}]
["S",0,1,18,0,0,3,0,0,"Serviço","1.18.3.","SINAPI","94993","EXECUÇÃO DE PASSEIO (CALÇADA) OU PISO DE CONCRETO COM CONCRETO MOLDADO IN LOCO, FEITO EM OBRA, ACABAMENTO CONVENCIONAL, ESPESSURA 6 CM, ARMADO. ","M2",{"$f":"OFFSET(PLQ!$E$12,ROW($P141)-ROW(P$12),0)","v":113.9},38.33,"BDI 1",48.5,5524.15,"",{"$f":"IF(OR($A141=0,$A141=\"S\",$A141>CFF!$A$9),\"\",MAX(V$12:OFFSET(V141,-1,0))+1)","v":""},"SINAPI-94993",10986,{"$f":"IF(Import.Desoneracao=\"sim\",Referencia.Desonerado,Referencia.NaoDesonerado)","v":45.09},{"$f":"ROUND(IF(ISNUMBER(R141),R141,IF(LEFT(R141,3)=\"BDI\",HLOOKUP(R141,DADOS!$T$37:$X$38,2,FALSE),0)),15-11*$X$5)","v":0.26519999999999999}]
[{"$f":"CHOOSE(1+LOG(1+2*(J142=\"Meta\")+4*(J142=\"Nível 2\")+8*(J142=\"Nível 3\")+16*(J142=\"Nível 4\")+32*(J142=\"Serviço\"),2),0,1,2,3,4,\"S\")","v":"S"},{"$f":"IF(OR(A142=\"S\",A142=0),0,IF(ISERROR(I142),H142,SMALL(H142:I142,1)))","v":0},{"$f":"IF($A142=1,OFFSET(C142,-1,0)+1,OFFSET(C142,-1,0))","v":1},{"$f":"IF($A142=1,0,IF($A142=2,OFFSET(D142,-1,0)+1,OFFSET(D142,-1,0)))","v":18},{"$f":"IF(AND($A142<=2,$A142<>0),0,IF($A142=3,OFFSET(E142,-1,0)+1,OFFSET(E142,-1,0)))","v":0},{"$f":"IF(AND($A142<=3,$A142<>0),0,IF($A142=4,OFFSET(F142,-1,0)+1,OFFSET(F142,-1,0)))","v":0},{"$f":"IF(AND($A142<=4,$A142<>0),0,IF($A142=\"S\",OFFSET(G142,-1,0)+1,OFFSET(G142,-1,0)))","v":4},0,0,"Serviço",{"$f":"IF($A142=0,\"-\",CONCATENATE(C142&\".\",IF(AND($A$5>=2,$A142>=2),D142&\".\",\"\"),IF(AND($A$5>=3,$A142>=3),E142&\".\",\"\"),IF(AND($A$5>=4,$A142>=4),F142&\".\",\"\"),IF($A142=\"S\",G142&\".\",\"\")))","v":"1.18.4."},"SINAPI","95031","PISO PODOTATIL DE CONCRETO ALERTA/DIRECIONAL *40 X 40 X 2,5*CM, SOBRE LASTRO DE CONCRETO ESPESSURA 3 CM E REJUNTE CIMENTICIO, EXCLUSO COLCHÃO","M2",{"$f":"OFFSET(PLQ!$E$12,ROW($P142)-ROW(P$12),0)","v":8.16},80.89,"BDI 1",102.34,835.09,{"$f":"IF($J142=\"\",\"\",IF($N142=\"\",\"DESCRIÇÃO\",IF(AND($J142=\"Serviço\",$O142=\"\"),\"UNIDADE\",IF($T142<=0,\"SEM VALOR\",IF(AND($Y142<>\"\",$Q142>$Y142),\"ACIMA REF.\",\"\")))))","v":""},{"$f":"IF(OR($A142=0,$A142=\"S\",$A142>CFF!$A$9),\"\",MAX(V$12:OFFSET(V142,-1,0))+1)","v":""},{"$f":"IF(AND($J142=\"Serviço\",$M142<>\"\"),IF($L142=\"\",$M142,CONCATENATE($L142,\"-\",$M142)))","v":"SINAPI-95031"},11846,{"$f":"IF(Import.Desoneracao=\"sim\",Referencia.Desonerado,Referencia.NaoDesonerado)","v":95.17},{"$f":"ROUND(IF(ISNUMBER(R142),R142,IF(LEFT(R142,3)=\"BDI\",HLOOKUP(R142,DADOS!$T$37:$X$38,2,FALSE),0)),15-11*$X$5)","v":0.26519999999999999}]
[{"$f":"CHOOSE(1+LOG(1+2*(J143=\"Meta\")+4*(J143=\"Nível 2\")+8*(J143=\"Nível 3\")+16*(J143=\"Nível 4\")+32*(J143=\"Serviço\"),2),0,1,2,3,4,\"S\")","v":"S"},{"$f":"IF(OR(A143=\"S\",A143=0),0,IF(ISERROR(I143),H143,SMALL(H143:I143,1)))","v":0},{"$f":"IF($A143=1,OFFSET(C143,-1,0)+1,OFFSET(C143,-1,0))","v":1},{"$f":"IF($A143=1,0,IF($A143=2,OFFSET(D143,-1,0)+1,OFFSET(D143,-1,0)))","v":18},{"$f":"IF(AND($A143<=2,$A143<>0),0,IF($A143=3,OFFSET(E143,-1,0)+1,OFFSET(E143,-1,0)))","v":0},{"$f":"IF(AND($A143<=3,$A143<>0),0,IF($A143=4,OFFSET(F143,-1,0)+1,OFFSET(F143,-1,0)))","v":0},{"$f":"IF(AND($A143<=4,$A143<>0),0,IF($A143=\"S\",OFFSET(G143,-1,0)+1,OFFSET(G143,-1,0)))","v":5},0,0,"Serviço",{"$f":"IF($A143=0,\"-\",CONCATENATE(C143&\".\",IF(AND($A$5>=2,$A143>=2),D143&\".\",\"\"),IF(AND($A$5>=3,$A143>=3),E143&\".\",\"\"),IF(AND($A$5>=4,$A143>=4),F143&\".\",\"\"),IF($A143=\"S\",G143&\".\",\"\")))","v":"1.18.5."},"SINAPI","84665","PINTURA ACRILICA PARA SINALIZAÇÃO HORIZONTAL EM PISO CIMENTADO","M2",{"$f":"OFFSET(PLQ!$E$12,ROW($P143)-ROW(P$12),0)","v":5.3},15.28,"BDI 1",{"$f":"IF($A143=\"S\",IF($Q$10=\"Preço Unitário (R$)\",PO.CustoUnitario,ROUND(PO.CustoUnitario*(1+$Z143),15-13*$X$6)),0)","v":19.329999999999998},{"$f":"IF($A143=\"S\",VTOTAL1,IF($A143=0,0,ROUND(SomaAgrup,15-13*$X$7)))","v":102.45},{"$f":"IF($J143=\"\",\"\",IF($N143=\"\",\"DESCRIÇÃO\",IF(AND($J143=\"Serviço\",$O143=\"\"),\"UNIDADE\",IF($T143<=0,\"SEM VALOR\",IF(AND($Y143<>\"\",$Q143>$Y143),\"ACIMA REF.\",\"\")))))","v":""},{"$f":"IF(OR($A143=0,$A143=\"S\",$A143>CFF!$A$9),\"\",MAX(V$12:OFFSET(V143,-1,0))+1)","v":""},{"$f":"IF(AND($J143=\"Serviço\",$M143<>\"\"),IF($L143=\"\",$M143,CONCATENATE($L143,\"-\",$M143)))","v":"SINAPI-84665"},{"$f":"IF(AND(Fonte<>\"\",Código<>\"\"),MATCH(Fonte&\" \"&IF(Fonte=\"sinapi\",SUBSTITUTE(SUBSTITUTE(Código,\"/00\",\"/\"),\"/0\",\"/\"),Código),INDIRECT(\"'[Referência \"&_xlnm.Database&\".xls]Banco'!$a:$a\"),0),\"X\")","v":10914},{"$f":"IF(Import.Desoneracao=\"sim\",Referencia.Desonerado,Referencia.NaoDesonerado)","v":17.98},{"$f":"ROUND(IF(ISNUMBER(R143),R143,IF(LEFT(R143,3)=\"BDI\",HLOOKUP(R143,DADOS!$T$37:$X$38,2,FALSE),0)),15-11*$X$5)","v":0.26519999999999999}]
["S",0,1,18,0,0,6,0,0,"Serviço","1.18.6.","SINAPI","98509","PLANTIO DE ARBUSTO COM ALTURA 50 A 70CM, EM CAVA DE 60X60X60CM","UN",{"$f":"OFFSET(PLQ!$E$12,ROW($P144)-ROW(P$12),0)","v":10},18.920000000000002,"BDI 1",23.94,239.4,"",{"$f":"IF(OR($A144=0,$A144=\"S\",$A144>CFF!$A$9),\"\",MAX(V$12:OFFSET(V144,-1,0))+1)","v":""},"SINAPI-98509",11804,{"$f":"IF(Import.Desoneracao=\"sim\",Referencia.Desonerado,Referencia.NaoDesonerado)","v":22.26},{"$f":"ROUND(IF(ISNUMBER(R144),R144,IF(LEFT(R144,3)=\"BDI\",HLOOKUP(R144,DADOS!$T$37:$X$38,2,FALSE),0)),15-11*$X$5)","v":0.26519999999999999}]
["S",0,1,18,0,0,7,0,0,"Serviço","1.18.7.","AMMOC","17","MURETA PARA FLOREIRA H:35CM, INCLUSO, CHAPISCO, EMBOÇO E PINTURA SOBRE LAJE","M",{"$f":"OFFSET(PLQ!$E$12,ROW($P145)-ROW(P$12),0)","v":20.85},42.02,"BDI 1",53.16,1108.3900000000001,"",{"$f":"IF(OR($A145=0,$A145=\"S\",$A145>CFF!$A$9),\"\",MAX(V$12:OFFSET(V145,-1,0))+1)","v":""},"AMMOC-17",23,{"$f":"IF(Import.Desoneracao=\"sim\",Referencia.Desonerado,Referencia.NaoDesonerado)","v":49.440000000000005},{"$f":"ROUND(IF(ISNUMBER(R145),R145,IF(LEFT(R145,3)=\"BDI\",HLOOKUP(R145,DADOS!$T$37:$X$38,2,FALSE),0)),15-11*$X$5)","v":0.26519999999999999}]
[2,8,1,19,0,0,0,21,8,"Nível 2","1.19.",null,null,"PREVENTIVO DE INCÊNDIO",{"$f":"Referencia.Unidade","v":""},{"$f":"OFFSET(PLQ!$E$12,ROW($P146)-ROW(P$12),0)","v":0},0,"BDI 1",0,4181.55,"",{"$f":"IF(OR($A146=0,$A146=\"S\",$A146>CFF!$A$9),\"\",MAX(V$12:OFFSET(V146,-1,0))+1)","v":20},false,"X",{"$f":"IF(Import.Desoneracao=\"sim\",Referencia.Desonerado,Referencia.NaoDesonerado)","v":0},{"$f":"ROUND(IF(ISNUMBER(R146),R146,IF(LEFT(R146,3)=\"BDI\",HLOOKUP(R146,DADOS!$T$37:$X$38,2,FALSE),0)),15-11*$X$5)","v":0.26519999999999999}]
["S",0,1,19,0,0,1,0,0,"Serviço","1.19.1.","SINAPI",72553,"EXTINTOR DE PQS 4KG - FORNECIMENTO E INSTALACAO","UN",{"$f":"OFFSET(PLQ!$E$12,ROW($P147)-ROW(P$12),0)","v":4},97.77,"BDI 1",123.7,494.8,"",{"$f":"IF(OR($A147=0,$A147=\"S\",$A147>CFF!$A$9),\"\",MAX(V$12:OFFSET(V147,-1,0))+1)","v":""},"SINAPI-72553",8603,{"$f":"IF(Import.Desoneracao=\"sim\",Referencia.Desonerado,Referencia.NaoDesonerado)","v":115.02},{"$f":"ROUND(IF(ISNUMBER(R147),R147,IF(LEFT(R147,3)=\"BDI\",HLOOKUP(R147,DADOS!$T$37:$X$38,2,FALSE),0)),15-11*$X$5)","v":0.26519999999999999}]
["S",0,1,19,0,0,2,0,0,"Serviço","1.19.2.","SINAPI-I","38774","LUMINARIA DE EMERGENCIA 30 LEDS, POTENCIA 2 W, BATERIA DE LITIO, AUTONOMIA DE 6 HORAS","UN",{"$f":"OFFSET(PLQ!$E$12,ROW($P148)-ROW(P$12),0)","v":12},25.9,"BDI 1",32.770000000000003,393.24,"",{"$f":"IF(OR($A148=0,$A148=\"S\",$A148>CFF!$A$9),\"\",MAX(V$12:OFFSET(V148,-1,0))+1)","v":""},"SINAPI-I-38774",3214,{"$f":"IF(Import.Desoneracao=\"sim\",Referencia.Desonerado,Referencia.NaoDesonerado)","v":30.47},{"$f":"ROUND(IF(ISNUMBER(R148),R148,IF(LEFT(R148,3)=\"BDI\",HLOOKUP(R148,DADOS!$T$37:$X$38,2,FALSE),0)),15-11*$X$5)","v":0.26519999999999999}]
["S",0,1,19,0,0,3,0,0,"Serviço","1.19.3.","COTAÇÃO","4  AMMOC ","LUMINÁRIA DE EMERGÊNCIA, BLOCO AUTONOMO 2 x 55 LEDS, FORNECIMENTO E INSTALAÇÃO","UN",{"$f":"OFFSET(PLQ!$E$12,ROW($P149)-ROW(P$12),0)","v":4},301.75,"BDI 2",301.75,1207,"",{"$f":"IF(OR($A149=0,$A149=\"S\",$A149>CFF!$A$9),\"\",MAX(V$12:OFFSET(V149,-1,0))+1)","v":""},"COTAÇÃO-4  AMMOC ",58,{"$f":"IF(Import.Desoneracao=\"sim\",Referencia.Desonerado,Referencia.NaoDesonerado)","v":355},{"$f":"ROUND(IF(ISNUMBER(R149),R149,IF(LEFT(R149,3)=\"BDI\",HLOOKUP(R149,DADOS!$T$37:$X$38,2,FALSE),0)),15-11*$X$5)","v":0}]
["S",0,1,19,0,0,4,0,0,"Serviço","1.19.4.","SINAPI-I","37558","PLACA DE SINALIZACAO DE SEGURANCA CONTRA INCENDIO, FOTOLUMINESCENTE, RETANGULAR, *20 X 40* CM, EM PVC *2* MM ANTI-CHAMAS (SIMBOLOS, CORES E PICTOGRAMAS CONFORME NBR 13434)","UN",{"$f":"OFFSET(PLQ!$E$12,ROW($P150)-ROW(P$12),0)","v":16},23.72,"BDI 1",{"$f":"IF($A150=\"S\",IF($Q$10=\"Preço Unitário (R$)\",PO.CustoUnitario,ROUND(PO.CustoUnitario*(1+$Z150),15-13*$X$6)),0)","v":30.01},{"$f":"IF($A150=\"S\",VTOTAL1,IF($A150=0,0,ROUND(SomaAgrup,15-13*$X$7)))","v":480.16},"",{"$f":"IF(OR($A150=0,$A150=\"S\",$A150>CFF!$A$9),\"\",MAX(V$12:OFFSET(V150,-1,0))+1)","v":""},"SINAPI-I-37558",{"$f":"IF(AND(Fonte<>\"\",Código<>\"\"),MATCH(Fonte&\" \"&IF(Fonte=\"sinapi\",SUBSTITUTE(SUBSTITUTE(Código,\"/00\",\"/\"),\"/0\",\"/\"),Código),INDIRECT(\"'[Referência \"&_xlnm.Database&\".xls]Banco'!$a:$a\"),0),\"X\")","v":4052},{"$f":"IF(Import.Desoneracao=\"sim\",Referencia.Desonerado,Referencia.NaoDesonerado)","v":27.91},{"$f":"ROUND(IF(ISNUMBER(R150),R150,IF(LEFT(R150,3)=\"BDI\",HLOOKUP(R150,DADOS!$T$37:$X$38,2,FALSE),0)),15-11*$X$5)","v":0.26519999999999999}]
["S",0,1,19,0,0,5,0,0,"Serviço","1.19.5.","SINAPI","92322","TUBO EM COBRE RÍGIDO, DN 28 CLASSE E, SEM ISOLAMENTO, INSTALADO EM RAMAL E SUB-RAMAL - FORNECIMENTO E INSTALAÇÃO","M",{"$f":"OFFSET(PLQ!$E$12,ROW($P151)-ROW(P$12),0)","v":2.5},50.73,"BDI 1",64.180000000000007,160.44999999999999,"",{"$f":"IF(OR($A151=0,$A151=\"S\",$A151>CFF!$A$9),\"\",MAX(V$12:OFFSET(V151,-1,0))+1)","v":""},"SINAPI-92322",8748,{"$f":"IF(Import.Desoneracao=\"sim\",Referencia.Desonerado,Referencia.NaoDesonerado)","v":59.68},{"$f":"ROUND(IF(ISNUMBER(R151),R151,IF(LEFT(R151,3)=\"BDI\",HLOOKUP(R151,DADOS!$T$37:$X$38,2,FALSE),0)),15-11*$X$5)","v":0.26519999999999999}]
["S",0,1,19,0,0,6,0,0,"Serviço","1.19.6.","SINAPI","92692","NIPLE, EM FERRO GALVANIZADO, CONEXÃO ROSQUEADA, DN 15 (1/2\"), INSTALADO EM RAMAIS E SUB-RAMAIS DE GÁS - FORNECIMENTO E INSTALAÇÃO","UN",{"$f":"OFFSET(PLQ!$E$12,ROW($P152)-ROW(P$12),0)","v":2},8.1300000000000008,"BDI 1",10.29,20.58,"",{"$f":"IF(OR($A152=0,$A152=\"S\",$A152>CFF!$A$9),\"\",MAX(V$12:OFFSET(V152,-1,0))+1)","v":""},"SINAPI-92692",9401,{"$f":"IF(Import.Desoneracao=\"sim\",Referencia.Desonerado,Referencia.NaoDesonerado)","v":9.57},{"$f":"ROUND(IF(ISNUMBER(R152),R152,IF(LEFT(R152,3)=\"BDI\",HLOOKUP(R152,DADOS!$T$37:$X$38,2,FALSE),0)),15-11*$X$5)","v":0.26519999999999999}]
["S",0,1,19,0,0,7,0,0,"Serviço","1.19.7.","AMMOC","5","ABRIGO DE GÁS - 2 BOTIJÕES","Unid",{"$f":"OFFSET(PLQ!$E$12,ROW($P153)-ROW(P$12),0)","v":1},1126.56,"BDI 1",1425.32,1425.32,"",{"$f":"IF(OR($A153=0,$A153=\"S\",$A153>CFF!$A$9),\"\",MAX(V$12:OFFSET(V153,-1,0))+1)","v":""},"AMMOC-5",11,{"$f":"IF(Import.Desoneracao=\"sim\",Referencia.Desonerado,Referencia.NaoDesonerado)","v":1325.3700000000001},{"$f":"ROUND(IF(ISNUMBER(R153),R153,IF(LEFT(R153,3)=\"BDI\",HLOOKUP(R153,DADOS!$T$37:$X$38,2,FALSE),0)),15-11*$X$5)","v":0.26519999999999999}]
[2,11,1,20,0,0,0,13,11,"Nível 2","1.20.",null,null,"ACESSIBILIDADE",{"$f":"Referencia.Unidade","v":""},{"$f":"OFFSET(PLQ!$E$12,ROW($P154)-ROW(P$12),0)","v":0},0,"BDI 1",0,6206.74,"",{"$f":"IF(OR($A154=0,$A154=\"S\",$A154>CFF!$A$9),\"\",MAX(V$12:OFFSET(V154,-1,0))+1)","v":21},false,"X",{"$f":"IF(Import.Desoneracao=\"sim\",Referencia.Desonerado,Referencia.NaoDesonerado)","v":0},{"$f":"ROUND(IF(ISNUMBER(R154),R154,IF(LEFT(R154,3)=\"BDI\",HLOOKUP(R154,DADOS!$T$37:$X$38,2,FALSE),0)),15-11*$X$5)","v":0.26519999999999999}]
["S",0,1,20,0,0,1,0,0,"Serviço","1.20.1.","COTAÇÃO","15  AMMOC ","PISO TÁTIL EM BORRACHA SINTÉTICA ALERTA E DIRECIONAL 250X250X5MM, COR AZUL OU PRETA","M2",{"$f":"OFFSET(PLQ!$E$12,ROW($P155)-ROW(P$12),0)","v":2.5},6.38,"BDI 2",6.38,15.95,"",{"$f":"IF(OR($A155=0,$A155=\"S\",$A155>CFF!$A$9),\"\",MAX(V$12:OFFSET(V155,-1,0))+1)","v":""},"COTAÇÃO-15  AMMOC ",69,{"$f":"IF(Import.Desoneracao=\"sim\",Referencia.Desonerado,Referencia.NaoDesonerado)","v":7.5},{"$f":"ROUND(IF(ISNUMBER(R155),R155,IF(LEFT(R155,3)=\"BDI\",HLOOKUP(R155,DADOS!$T$37:$X$38,2,FALSE),0)),15-11*$X$5)","v":0}]
["S",0,1,20,0,0,2,0,0,"Serviço","1.20.2.","COTAÇÃO","17  AMMOC ","PLACA TÁTIL BRAILLE/RELEVO ACRÍLICO 30X14CM - USO SINALIZAÇÃO DE PORTAS DIVERSAS (04 PALAVRAS)","UN",{"$f":"OFFSET(PLQ!$E$12,ROW($P156)-ROW(P$12),0)","v":5},29.75,"BDI 2",29.75,148.75,"",{"$f":"IF(OR($A156=0,$A156=\"S\",$A156>CFF!$A$9),\"\",MAX(V$12:OFFSET(V156,-1,0))+1)","v":""},"COTAÇÃO-17  AMMOC ",71,{"$f":"IF(Import.Desoneracao=\"sim\",Referencia.Desonerado,Referencia.NaoDesonerado)","v":35},{"$f":"ROUND(IF(ISNUMBER(R156),R156,IF(LEFT(R156,3)=\"BDI\",HLOOKUP(R156,DADOS!$T$37:$X$38,2,FALSE),0)),15-11*$X$5)","v":0}]
["S",0,1,20,0,0,3,0,0,"Serviço","1.20.3.","COTAÇÃO","18  AMMOC ","PLACA TÁTIL BRAILLE/RELEVO AÇO INÓX 100X30MM - PERSONALIZADO USO CORRIMÃO","UN",{"$f":"OFFSET(PLQ!$E$12,ROW($P157)-ROW(P$12),0)","v":2},11.9,"BDI 2",11.9,23.8,"",{"$f":"IF(OR($A157=0,$A157=\"S\",$A157>CFF!$A$9),\"\",MAX(V$12:OFFSET(V157,-1,0))+1)","v":""},"COTAÇÃO-18  AMMOC ",72,{"$f":"IF(Import.Desoneracao=\"sim\",Referencia.Desonerado,Referencia.NaoDesonerado)","v":14},{"$f":"ROUND(IF(ISNUMBER(R157),R157,IF(LEFT(R157,3)=\"BDI\",HLOOKUP(R157,DADOS!$T$37:$X$38,2,FALSE),0)),15-11*$X$5)","v":0}]
["S",0,1,20,0,0,4,0,0,"Serviço","1.20.4.","COTAÇÃO","19  AMMOC ","SINALIZADOR VISUAL DE DEGRAUS FOTOLUMINESCENTE AMARELO 70X30MM","UN",{"$f":"OFFSET(PLQ!$E$12,ROW($P158)-ROW(P$12),0)","v":50},4.08,"BDI 2",4.08,204,"",{"$f":"IF(OR($A158=0,$A158=\"S\",$A158>CFF!$A$9),\"\",MAX(V$12:OFFSET(V158,-1,0))+1)","v":""},"COTAÇÃO-19  AMMOC ",73,{"$f":"IF(Import.Desoneracao=\"sim\",Referencia.Desonerado,Referencia.NaoDesonerado)","v":4.8},{"$f":"ROUND(IF(ISNUMBER(R158),R158,IF(LEFT(R158,3)=\"BDI\",HLOOKUP(R158,DADOS!$T$37:$X$38,2,FALSE),0)),15-11*$X$5)","v":0}]
["S",0,1,20,0,0,5,0,0,"Serviço","1.20.5.","COTAÇÃO","20  AMMOC ","PLACA VINIL AUTOADESIVA COM SIMBOLOS DIVERSOS 150X200MM","UN",{"$f":"OFFSET(PLQ!$E$12,ROW($P159)-ROW(P$12),0)","v":4},8.06,"BDI 2",8.06,32.24,"",{"$f":"IF(OR($A159=0,$A159=\"S\",$A159>CFF!$A$9),\"\",MAX(V$12:OFFSET(V159,-1,0))+1)","v":""},"COTAÇÃO-20  AMMOC ",74,{"$f":"IF(Import.Desoneracao=\"sim\",Referencia.Desonerado,Referencia.NaoDesonerado)","v":9.48},{"$f":"ROUND(IF(ISNUMBER(R159),R159,IF(LEFT(R159,3)=\"BDI\",HLOOKUP(R159,DADOS!$T$37:$X$38,2,FALSE),0)),15-11*$X$5)","v":0}]
["S",0,1,20,0,0,6,0,0,"Serviço","1.20.6.","COTAÇÃO","21  AMMOC ","PROTETOR DE IMPACTO PARA PORTA EM BORRACHA PRETA OU AZUL - ALTURA DE 40CM E LARGURA DE 80 OU 90CM","UN",{"$f":"OFFSET(PLQ!$E$12,ROW($P160)-ROW(P$12),0)","v":8},76.42,"BDI 2",76.42,611.36,"",{"$f":"IF(OR($A160=0,$A160=\"S\",$A160>CFF!$A$9),\"\",MAX(V$12:OFFSET(V160,-1,0))+1)","v":""},"COTAÇÃO-21  AMMOC ",75,{"$f":"IF(Import.Desoneracao=\"sim\",Referencia.Desonerado,Referencia.NaoDesonerado)","v":89.9},{"$f":"ROUND(IF(ISNUMBER(R160),R160,IF(LEFT(R160,3)=\"BDI\",HLOOKUP(R160,DADOS!$T$37:$X$38,2,FALSE),0)),15-11*$X$5)","v":0}]
["S",0,1,20,0,0,7,0,0,"Serviço","1.20.7.","COTAÇÃO","22  AMMOC ","BARRA DE APOIO  RETA, EM AÇO INOX POLIDO 40CM","UN",{"$f":"OFFSET(PLQ!$E$12,ROW($P161)-ROW(P$12),0)","v":16},113.89999999999999,"BDI 2",113.9,1822.4,"",{"$f":"IF(OR($A161=0,$A161=\"S\",$A161>CFF!$A$9),\"\",MAX(V$12:OFFSET(V161,-1,0))+1)","v":""},"COTAÇÃO-22  AMMOC ",76,{"$f":"IF(Import.Desoneracao=\"sim\",Referencia.Desonerado,Referencia.NaoDesonerado)","v":134},{"$f":"ROUND(IF(ISNUMBER(R161),R161,IF(LEFT(R161,3)=\"BDI\",HLOOKUP(R161,DADOS!$T$37:$X$38,2,FALSE),0)),15-11*$X$5)","v":0}]
["S",0,1,20,0,0,8,0,0,"Serviço","1.20.8.","SINAPI-I",36081,"BARRA DE APOIO RETA, EM ACO INOX POLIDO, COMPRIMENTO 80CM, DIAMETRO MINIMO 3 CM","UN",{"$f":"OFFSET(PLQ!$E$12,ROW($P162)-ROW(P$12),0)","v":8},145.16,"BDI 1",183.66,1469.28,"",{"$f":"IF(OR($A162=0,$A162=\"S\",$A162>CFF!$A$9),\"\",MAX(V$12:OFFSET(V162,-1,0))+1)","v":""},"SINAPI-I-36081",790,{"$f":"IF(Import.Desoneracao=\"sim\",Referencia.Desonerado,Referencia.NaoDesonerado)","v":170.78},{"$f":"ROUND(IF(ISNUMBER(R162),R162,IF(LEFT(R162,3)=\"BDI\",HLOOKUP(R162,DADOS!$T$37:$X$38,2,FALSE),0)),15-11*$X$5)","v":0.26519999999999999}]
[{"$f":"CHOOSE(1+LOG(1+2*(J163=\"Meta\")+4*(J163=\"Nível 2\")+8*(J163=\"Nível 3\")+16*(J163=\"Nível 4\")+32*(J163=\"Serviço\"),2),0,1,2,3,4,\"S\")","v":"S"},{"$f":"IF(OR(A163=\"S\",A163=0),0,IF(ISERROR(I163),H163,SMALL(H163:I163,1)))","v":0},{"$f":"IF($A163=1,OFFSET(C163,-1,0)+1,OFFSET(C163,-1,0))","v":1},{"$f":"IF($A163=1,0,IF($A163=2,OFFSET(D163,-1,0)+1,OFFSET(D163,-1,0)))","v":20},{"$f":"IF(AND($A163<=2,$A163<>0),0,IF($A163=3,OFFSET(E163,-1,0)+1,OFFSET(E163,-1,0)))","v":0},{"$f":"IF(AND($A163<=3,$A163<>0),0,IF($A163=4,OFFSET(F163,-1,0)+1,OFFSET(F163,-1,0)))","v":0},{"$f":"IF(AND($A163<=4,$A163<>0),0,IF($A163=\"S\",OFFSET(G163,-1,0)+1,OFFSET(G163,-1,0)))","v":9},0,0,"Serviço",{"$f":"IF($A163=0,\"-\",CONCATENATE(C163&\".\",IF(AND($A$5>=2,$A163>=2),D163&\".\",\"\"),IF(AND($A$5>=3,$A163>=3),E163&\".\",\"\"),IF(AND($A$5>=4,$A163>=4),F163&\".\",\"\"),IF($A163=\"S\",G163&\".\",\"\")))","v":"1.20.9."},"SINAPI-I",36205,"BARRA DE APOIO RETA, EM ACO INOX POLIDO, COMPRIMENTO 70CM, DIAMETRO MINIMO 3 CM","UN",{"$f":"OFFSET(PLQ!$E$12,ROW($P163)-ROW(P$12),0)","v":4},136.13999999999999,"BDI 1",{"$f":"IF($A163=\"S\",IF($Q$10=\"Preço Unitário (R$)\",PO.CustoUnitario,ROUND(PO.CustoUnitario*(1+$Z163),15-13*$X$6)),0)","v":172.24},{"$f":"IF($A163=\"S\",VTOTAL1,IF($A163=0,0,ROUND(SomaAgrup,15-13*$X$7)))","v":688.96},{"$f":"IF($J163=\"\",\"\",IF($N163=\"\",\"DESCRIÇÃO\",IF(AND($J163=\"Serviço\",$O163=\"\"),\"UNIDADE\",IF($T163<=0,\"SEM VALOR\",IF(AND($Y163<>\"\",$Q163>$Y163),\"ACIMA REF.\",\"\")))))","v":""},{"$f":"IF(OR($A163=0,$A163=\"S\",$A163>CFF!$A$9),\"\",MAX(V$12:OFFSET(V163,-1,0))+1)","v":""},{"$f":"IF(AND($J163=\"Serviço\",$M163<>\"\"),IF($L163=\"\",$M163,CONCATENATE($L163,\"-\",$M163)))","v":"SINAPI-I-36205"},{"$f":"IF(AND(Fonte<>\"\",Código<>\"\"),MATCH(Fonte&\" \"&IF(Fonte=\"sinapi\",SUBSTITUTE(SUBSTITUTE(Código,\"/00\",\"/\"),\"/0\",\"/\"),Código),INDIRECT(\"'[Referência \"&_xlnm.Database&\".xls]Banco'!$a:$a\"),0),\"X\")","v":789},{"$f":"IF(Import.Desoneracao=\"sim\",Referencia.Desonerado,Referencia.NaoDesonerado)","v":160.16999999999999},{"$f":"ROUND(IF(ISNUMBER(R163),R163,IF(LEFT(R163,3)=\"BDI\",HLOOKUP(R163,DADOS!$T$37:$X$38,2,FALSE),0)),15-11*$X$5)","v":0.26519999999999999}]
[{"$f":"CHOOSE(1+LOG(1+2*(J164=\"Meta\")+4*(J164=\"Nível 2\")+8*(J164=\"Nível 3\")+16*(J164=\"Nível 4\")+32*(J164=\"Serviço\"),2),0,1,2,3,4,\"S\")","v":"S"},{"$f":"IF(OR(A164=\"S\",A164=0),0,IF(ISERROR(I164),H164,SMALL(H164:I164,1)))","v":0},{"$f":"IF($A164=1,OFFSET(C164,-1,0)+1,OFFSET(C164,-1,0))","v":1},{"$f":"IF($A164=1,0,IF($A164=2,OFFSET(D164,-1,0)+1,OFFSET(D164,-1,0)))","v":20},{"$f":"IF(AND($A164<=2,$A164<>0),0,IF($A164=3,OFFSET(E164,-1,0)+1,OFFSET(E164,-1,0)))","v":0},{"$f":"IF(AND($A164<=3,$A164<>0),0,IF($A164=4,OFFSET(F164,-1,0)+1,OFFSET(F164,-1,0)))","v":0},{"$f":"IF(AND($A164<=4,$A164<>0),0,IF($A164=\"S\",OFFSET(G164,-1,0)+1,OFFSET(G164,-1,0)))","v":10},0,0,"Serviço",{"$f":"IF($A164=0,\"-\",CONCATENATE(C164&\".\",IF(AND($A$5>=2,$A164>=2),D164&\".\",\"\"),IF(AND($A$5>=3,$A164>=3),E164&\".\",\"\"),IF(AND($A$5>=4,$A164>=4),F164&\".\",\"\"),IF($A164=\"S\",G164&\".\",\"\")))","v":"1.20.10."},"COTAÇÃO","5  AMMOC ","SIRENE AUDIOVISUAL PCD (NBR 9050)","UN",{"$f":"OFFSET(PLQ!$E$12,ROW($P164)-ROW(P$12),0)","v":4},297.5,"BDI 2",{"$f":"IF($A164=\"S\",IF($Q$10=\"Preço Unitário (R$)\",PO.CustoUnitario,ROUND(PO.CustoUnitario*(1+$Z164),15-13*$X$6)),0)","v":297.5},{"$f":"IF($A164=\"S\",VTOTAL1,IF($A164=0,0,ROUND(SomaAgrup,15-13*$X$7)))","v":1190},{"$f":"IF($J164=\"\",\"\",IF($N164=\"\",\"DESCRIÇÃO\",IF(AND($J164=\"Serviço\",$O164=\"\"),\"UNIDADE\",IF($T164<=0,\"SEM VALOR\",IF(AND($Y164<>\"\",$Q164>$Y164),\"ACIMA REF.\",\"\")))))","v":""},{"$f":"IF(OR($A164=0,$A164=\"S\",$A164>CFF!$A$9),\"\",MAX(V$12:OFFSET(V164,-1,0))+1)","v":""},{"$f":"IF(AND($J164=\"Serviço\",$M164<>\"\"),IF($L164=\"\",$M164,CONCATENATE($L164,\"-\",$M164)))","v":"COTAÇÃO-5  AMMOC "},{"$f":"IF(AND(Fonte<>\"\",Código<>\"\"),MATCH(Fonte&\" \"&IF(Fonte=\"sinapi\",SUBSTITUTE(SUBSTITUTE(Código,\"/00\",\"/\"),\"/0\",\"/\"),Código),INDIRECT(\"'[Referência \"&_xlnm.Database&\".xls]Banco'!$a:$a\"),0),\"X\")","v":59},{"$f":"IF(Import.Desoneracao=\"sim\",Referencia.Desonerado,Referencia.NaoDesonerado)","v":350},{"$f":"ROUND(IF(ISNUMBER(R164),R164,IF(LEFT(R164,3)=\"BDI\",HLOOKUP(R164,DADOS!$T$37:$X$38,2,FALSE),0)),15-11*$X$5)","v":0}]
[2,2,1,21,0,0,0,2,{"$error":"#N/A"},"Nível 2","1.21.",null,null,"SERVIÇOS FINAIS",{"$f":"Referencia.Unidade","v":""},{"$f":"OFFSET(PLQ!$E$12,ROW($P165)-ROW(P$12),0)","v":0},null,"BDI 1",0,1476,"",{"$f":"IF(OR($A165=0,$A165=\"S\",$A165>CFF!$A$9),\"\",MAX(V$12:OFFSET(V165,-1,0))+1)","v":22},false,"X",{"$f":"IF(Import.Desoneracao=\"sim\",Referencia.Desonerado,Referencia.NaoDesonerado)","v":0},{"$f":"ROUND(IF(ISNUMBER(R165),R165,IF(LEFT(R165,3)=\"BDI\",HLOOKUP(R165,DADOS!$T$37:$X$38,2,FALSE),0)),15-11*$X$5)","v":0.26519999999999999}]
["S",0,1,21,0,0,1,0,0,"Serviço","1.21.1.","SINAPI","9537","LIMPEZA FINAL DA OBRA","M2",{"$f":"OFFSET(PLQ!$E$12,ROW($P166)-ROW(P$12),0)","v":630.77},1.853,"BDI 1",2.34,1476,"",{"$f":"IF(OR($A166=0,$A166=\"S\",$A166>CFF!$A$9),\"\",MAX(V$12:OFFSET(V166,-1,0))+1)","v":""},"SINAPI-9537",11569,{"$f":"IF(Import.Desoneracao=\"sim\",Referencia.Desonerado,Referencia.NaoDesonerado)","v":2.1800000000000002},{"$f":"ROUND(IF(ISNUMBER(R166),R166,IF(LEFT(R166,3)=\"BDI\",HLOOKUP(R166,DADOS!$T$37:$X$38,2,FALSE),0)),15-11*$X$5)","v":0.26519999999999999}]
[-1,null,0,0,0,0,0]
[null,null,null,null,null,null,null,null,null,null,"Encargos sociais:",null,"Para elaboração deste orçamento, foram utilizados os encargos sociais do SINAPI para a Unidade da Federação indicada."]
[]
[null,null,null,null,null,null,null,null,null,null,"Observações:"]
[]
[]
[]
[]
[null,null,null,null,null,null,null,null,null,null,{"$f":"IF(AND($X$3=FALSE,$X$4=FALSE,$X$5=FALSE,$X$6=FALSE,$X$7=FALSE),\"Não foi considerado arredondamento nos valores da planilha.\",CONCATENATE(\"Foi considerado arredondamento de duas casas decimais para \",IF($X$3=TRUE,\"Quantidade; \",\"\"),IF($X$4=TRUE,\"Custo Unitário; \",\"\"),IF($X$5=TRUE,\"BDI; \",\"\"),IF($X$6=TRUE,\"Preço Unitário; \",\"\"),IF($X$7=TRUE,\"Preço Total.\",\"\")))","v":"Foi considerado arredondamento de duas casas decimais para Quantidade; Custo Unitário; BDI; Preço Unitário; Preço Total."}]
[]
[]
[null,null,null,null,null,null,null,null,null,null,{"$f":"Import.Município","v":"VARGEM BONITA/SC"}]
[null,null,null,null,null,null,null,null,null,null,"Local"]
[]
[null,null,null,null,null,null,null,null,null,null,{"$f":"TODAY()","v":"2019-03-18"}]
[null,null,null,null,null,null,null,null,null,null,"Data"]

{"sheet":"PLQ","index":5,"n_rows":173,"n_cols":21,"rows_kept":173,"cut":false,"hidden":false,"merged":[[168,1,168,2],[171,1,171,2]]}
[null,null,null,null,"PLQ -","PLANILHA DE LEVANTAMENTO DE QUANTIDADES"]
[]
[]
[]
[]
[]
[null,null,null,null,{"$f":"OFFSET(PO!$P$12,ROW($E7)-ROW(E$12),0)","v":0}]
[]
[null,null,null,null,"-","Térreo","1º Pavimento","Barrilete e Caixa dágua"]
["Nível","Item","Descrição","Unid.","Quantidade",{"$f":"IF(OFFSET(F10,0,-1)=\"Quantidade\",1,OFFSET(F10,0,-1)+1)","v":1},2,3,4,5,6,7,8,9,10,null,null,null,null,null,{"$f":"IF(OFFSET(U10,0,-1)=\"Quantidade\",1,OFFSET(U10,0,-1)+1)","v":1}]
[{"$f":"OFFSET(PO!J$12,ROW(A11)-ROW($A$12),0)","v":"Serviço"},{"$f":"IF($A11=0,\"\",OFFSET(PO!K$12,ROW(B11)-ROW(B$12),0))","v":{"$error":"#VALUE!"}},{"$f":"IF(OFFSET(PO!N$12,ROW(C11)-ROW(C$12),0)=0,\"\",OFFSET(PO!N$12,ROW(C11)-ROW(C$12),0))","v":""},{"$f":"IF(OFFSET(PO!O$12,ROW(D11)-ROW(D$12),0)=0,\"\",OFFSET(PO!O$12,ROW(D11)-ROW(D$12),0))","v":""},{"$f":"IF($A11<>\"Serviço\",0,ROUND(SUMIF($F$9:$P$9,\"<>\",$F11:$P11),15-13*PO!$X$3))","v":0}]
[{"$f":"PO!J12","v":"LOTE"},null,{"$f":"PO!N12","v":0}]
[{"$f":"OFFSET(PO!J$12,ROW(A13)-ROW($A$12),0)","v":"Meta"},{"$f":"IF($A13=0,\"\",OFFSET(PO!K$12,ROW(B13)-ROW(B$12),0))","v":"1."},{"$f":"IF(OFFSET(PO!N$12,ROW(C13)-ROW(C$12),0)=0,\"\",OFFSET(PO!N$12,ROW(C13)-ROW(C$12),0))","v":"CASA DO PRODUTOR"},{"$f":"IF(OFFSET(PO!O$12,ROW(D13)-ROW(D$12),0)=0,\"\",OFFSET(PO!O$12,ROW(D13)-ROW(D$12),0))","v":""},{"$f":"IF($A13<>\"Serviço\",0,ROUND(SUMIF($F$9:$P$9,\"<>\",$F13:$P13),15-13*PO!$X$3))","v":0},0]
[{"$f":"OFFSET(PO!J$12,ROW(A14)-ROW($A$12),0)","v":"Nível 2"},{"$f":"IF($A14=0,\"\",OFFSET(PO!K$12,ROW(B14)-ROW(B$12),0))","v":"1.1."},{"$f":"IF(OFFSET(PO!N$12,ROW(C14)-ROW(C$12),0)=0,\"\",OFFSET(PO!N$12,ROW(C14)-ROW(C$12),0))","v":"SERVIÇOS INICIAIS"},{"$f":"IF(OFFSET(PO!O$12,ROW(D14)-ROW(D$12),0)=0,\"\",OFFSET(PO!O$12,ROW(D14)-ROW(D$12),0))","v":"M2"},{"$f":"IF($A14<>\"Serviço\",0,ROUND(SUMIF($F$9:$P$9,\"<>\",$F14:$P14),15-13*PO!$X$3))","v":0},0]
[{"$f":"OFFSET(PO!J$12,ROW(A15)-ROW($A$12),0)","v":"Serviço"},{"$f":"IF($A15=0,\"\",OFFSET(PO!K$12,ROW(B15)-ROW(B$12),0))","v":"1.1.1."},{"$f":"IF(OFFSET(PO!N$12,ROW(C15)-ROW(C$12),0)=0,\"\",OFFSET(PO!N$12,ROW(C15)-ROW(C$12),0))","v":"PLACA DE OBRA EM CHAPA DE ACO GALVANIZADO PADRÃO GOVERNO FEDERAL"},{"$f":"IF(OFFSET(PO!O$12,ROW(D15)-ROW(D$12),0)=0,\"\",OFFSET(PO!O$12,ROW(D15)-ROW(D$12),0))","v":"M2"},{"$f":"IF($A15<>\"Serviço\",0,ROUND(SUMIF($F$9:$P$9,\"<>\",$F15:$P15),15-13*PO!$X$3))","v":2.5},2.5]
[{"$f":"OFFSET(PO!J$12,ROW(A16)-ROW($A$12),0)","v":"Serviço"},{"$f":"IF($A16=0,\"\",OFFSET(PO!K$12,ROW(B16)-ROW(B$12),0))","v":"1.1.2."},{"$f":"IF(OFFSET(PO!N$12,ROW(C16)-ROW(C$12),0)=0,\"\",OFFSET(PO!N$12,ROW(C16)-ROW(C$12),0))","v":"PLACA DE OBRA EM CHAPA DE ACO GALVANIZADO PADRÃO AMMOC"},{"$f":"IF(OFFSET(PO!O$12,ROW(D16)-ROW(D$12),0)=0,\"\",OFFSET(PO!O$12,ROW(D16)-ROW(D$12),0))","v":"M2"},{"$f":"IF($A16<>\"Serviço\",0,ROUND(SUMIF($F$9:$P$9,\"<>\",$F16:$P16),15-13*PO!$X$3))","v":2.5},2.5]
[{"$f":"OFFSET(PO!J$12,ROW(A17)-ROW($A$12),0)","v":"Serviço"},{"$f":"IF($A17=0,\"\",OFFSET(PO!K$12,ROW(B17)-ROW(B$12),0))","v":"1.1.3."},{"$f":"IF(OFFSET(PO!N$12,ROW(C17)-ROW(C$12),0)=0,\"\",OFFSET(PO!N$12,ROW(C17)-ROW(C$12),0))","v":"LOCACAO CONVENCIONAL DE OBRA, ATRAVÉS DE GABARITO DE TABUAS CORRIDAS PONTALETADAS"},{"$f":"IF(OFFSET(PO!O$12,ROW(D17)-ROW(D$12),0)=0,\"\",OFFSET(PO!O$12,ROW(D17)-ROW(D$12),0))","v":"M2"},{"$f":"IF($A17<>\"Serviço\",0,ROUND(SUMIF($F$9:$P$9,\"<>\",$F17:$P17),15-13*PO!$X$3))","v":317.02999999999997},317.02999999999997]
[{"$f":"OFFSET(PO!J$12,ROW(A18)-ROW($A$12),0)","v":"Nível 2"},{"$f":"IF($A18=0,\"\",OFFSET(PO!K$12,ROW(B18)-ROW(B$12),0))","v":"1.2."},{"$f":"IF(OFFSET(PO!N$12,ROW(C18)-ROW(C$12),0)=0,\"\",OFFSET(PO!N$12,ROW(C18)-ROW(C$12),0))","v":"ESCAVAÇÔES E REATERRO"},{"$f":"IF(OFFSET(PO!O$12,ROW(D18)-ROW(D$12),0)=0,\"\",OFFSET(PO!O$12,ROW(D18)-ROW(D$12),0))","v":""},{"$f":"IF($A18<>\"Serviço\",0,ROUND(SUMIF($F$9:$P$9,\"<>\",$F18:$P18),15-13*PO!$X$3))","v":0},0]
[{"$f":"OFFSET(PO!J$12,ROW(A19)-ROW($A$12),0)","v":"Serviço"},{"$f":"IF($A19=0,\"\",OFFSET(PO!K$12,ROW(B19)-ROW(B$12),0))","v":"1.2.1."},{"$f":"IF(OFFSET(PO!N$12,ROW(C19)-ROW(C$12),0)=0,\"\",OFFSET(PO!N$12,ROW(C19)-ROW(C$12),0))","v":"ESCAVAÇÃO DE VALA COM PROFUNDIDADE ATÉ 1,5 M "},{"$f":"IF(OFFSET(PO!O$12,ROW(D19)-ROW(D$12),0)=0,\"\",OFFSET(PO!O$12,ROW(D19)-ROW(D$12),0))","v":"M3"},{"$f":"IF($A19<>\"Serviço\",0,ROUND(SUMIF($F$9:$P$9,\"<>\",$F19:$P19),15-13*PO!$X$3))","v":59.08},59.08]
[{"$f":"OFFSET(PO!J$12,ROW(A20)-ROW($A$12),0)","v":"Serviço"},{"$f":"IF($A20=0,\"\",OFFSET(PO!K$12,ROW(B20)-ROW(B$12),0))","v":"1.2.2."},{"$f":"IF(OFFSET(PO!N$12,ROW(C20)-ROW(C$12),0)=0,\"\",OFFSET(PO!N$12,ROW(C20)-ROW(C$12),0))","v":"REATERRO MANUAL DE VALAS COM COMPACTAÇÃO "},{"$f":"IF(OFFSET(PO!O$12,ROW(D20)-ROW(D$12),0)=0,\"\",OFFSET(PO!O$12,ROW(D20)-ROW(D$12),0))","v":"M3"},{"$f":"IF($A20<>\"Serviço\",0,ROUND(SUMIF($F$9:$P$9,\"<>\",$F20:$P20),15-13*PO!$X$3))","v":13.47},13.47]
[{"$f":"OFFSET(PO!J$12,ROW(A21)-ROW($A$12),0)","v":"Nível 2"},{"$f":"IF($A21=0,\"\",OFFSET(PO!K$12,ROW(B21)-ROW(B$12),0))","v":"1.3."},{"$f":"IF(OFFSET(PO!N$12,ROW(C21)-ROW(C$12),0)=0,\"\",OFFSET(PO!N$12,ROW(C21)-ROW(C$12),0))","v":"FUNDAÇÕES: BLOCOS E BALDRAMES"},{"$f":"IF(OFFSET(PO!O$12,ROW(D21)-ROW(D$12),0)=0,\"\",OFFSET(PO!O$12,ROW(D21)-ROW(D$12),0))","v":""},{"$f":"IF($A21<>\"Serviço\",0,ROUND(SUMIF($F$9:$P$9,\"<>\",$F21:$P21),15-13*PO!$X$3))","v":0},0]
[{"$f":"OFFSET(PO!J$12,ROW(A22)-ROW($A$12),0)","v":"Serviço"},{"$f":"IF($A22=0,\"\",OFFSET(PO!K$12,ROW(B22)-ROW(B$12),0))","v":"1.3.1."},{"$f":"IF(OFFSET(PO!N$12,ROW(C22)-ROW(C$12),0)=0,\"\",OFFSET(PO!N$12,ROW(C22)-ROW(C$12),0))","v":"ESTACA ESCAVADA MECANICAMENTE, SEM FLUIDO ESTABILIZANTE, COM 40 CM DE DIÂMETRO, ATÉ 9 M DE COMPRIMENTO, CONCRETO LANÇADO POR CAMINHÃO BETONEIRA "},{"$f":"IF(OFFSET(PO!O$12,ROW(D22)-ROW(D$12),0)=0,\"\",OFFSET(PO!O$12,ROW(D22)-ROW(D$12),0))","v":"M"},{"$f":"IF($A22<>\"Serviço\",0,ROUND(SUMIF($F$9:$P$9,\"<>\",$F22:$P22),15-13*PO!$X$3))","v":235},235]
[{"$f":"OFFSET(PO!J$12,ROW(A23)-ROW($A$12),0)","v":"Serviço"},{"$f":"IF($A23=0,\"\",OFFSET(PO!K$12,ROW(B23)-ROW(B$12),0))","v":"1.3.2."},{"$f":"IF(OFFSET(PO!N$12,ROW(C23)-ROW(C$12),0)=0,\"\",OFFSET(PO!N$12,ROW(C23)-ROW(C$12),0))","v":"PEDRA BRITADA N. 2 PARA LASTRO"},{"$f":"IF(OFFSET(PO!O$12,ROW(D23)-ROW(D$12),0)=0,\"\",OFFSET(PO!O$12,ROW(D23)-ROW(D$12),0))","v":"M3"},{"$f":"IF($A23<>\"Serviço\",0,ROUND(SUMIF($F$9:$P$9,\"<>\",$F23:$P23),15-13*PO!$X$3))","v":1.94},1.94]
[{"$f":"OFFSET(PO!J$12,ROW(A24)-ROW($A$12),0)","v":"Serviço"},{"$f":"IF($A24=0,\"\",OFFSET(PO!K$12,ROW(B24)-ROW(B$12),0))","v":"1.3.3."},{"$f":"IF(OFFSET(PO!N$12,ROW(C24)-ROW(C$12),0)=0,\"\",OFFSET(PO!N$12,ROW(C24)-ROW(C$12),0))","v":"BLOCOS EM CONCRETO ARMADO, Fck=30 Mpa"},{"$f":"IF(OFFSET(PO!O$12,ROW(D24)-ROW(D$12),0)=0,\"\",OFFSET(PO!O$12,ROW(D24)-ROW(D$12),0))","v":"M3"},{"$f":"IF($A24<>\"Serviço\",0,ROUND(SUMIF($F$9:$P$9,\"<>\",$F24:$P24),15-13*PO!$X$3))","v":17.3},17.3]
[{"$f":"OFFSET(PO!J$12,ROW(A25)-ROW($A$12),0)","v":"Serviço"},{"$f":"IF($A25=0,\"\",OFFSET(PO!K$12,ROW(B25)-ROW(B$12),0))","v":"1.3.4."},{"$f":"IF(OFFSET(PO!N$12,ROW(C25)-ROW(C$12),0)=0,\"\",OFFSET(PO!N$12,ROW(C25)-ROW(C$12),0))","v":"VIGAS BALDRAMES EM CONCRETO ARMADO, Fck=30 Mpa"},{"$f":"IF(OFFSET(PO!O$12,ROW(D25)-ROW(D$12),0)=0,\"\",OFFSET(PO!O$12,ROW(D25)-ROW(D$12),0))","v":"M3"},{"$f":"IF($A25<>\"Serviço\",0,ROUND(SUMIF($F$9:$P$9,\"<>\",$F25:$P25),15-13*PO!$X$3))","v":14.2},14.2]
[{"$f":"OFFSET(PO!J$12,ROW(A26)-ROW($A$12),0)","v":"Serviço"},{"$f":"IF($A26=0,\"\",OFFSET(PO!K$12,ROW(B26)-ROW(B$12),0))","v":"1.3.5."},{"$f":"IF(OFFSET(PO!N$12,ROW(C26)-ROW(C$12),0)=0,\"\",OFFSET(PO!N$12,ROW(C26)-ROW(C$12),0))","v":"IMPERMEABILIZACAO DOS BALDRAMES COM TINTA ASFALTICA, DUAS DEMAOS."},{"$f":"IF(OFFSET(PO!O$12,ROW(D26)-ROW(D$12),0)=0,\"\",OFFSET(PO!O$12,ROW(D26)-ROW(D$12),0))","v":"M2"},{"$f":"IF($A26<>\"Serviço\",0,ROUND(SUMIF($F$9:$P$9,\"<>\",$F26:$P26),15-13*PO!$X$3))","v":194.99},194.99]
[{"$f":"OFFSET(PO!J$12,ROW(A27)-ROW($A$12),0)","v":"Nível 2"},{"$f":"IF($A27=0,\"\",OFFSET(PO!K$12,ROW(B27)-ROW(B$12),0))","v":"1.4."},{"$f":"IF(OFFSET(PO!N$12,ROW(C27)-ROW(C$12),0)=0,\"\",OFFSET(PO!N$12,ROW(C27)-ROW(C$12),0))","v":"ESTRUTURA: VIGAS "},{"$f":"IF(OFFSET(PO!O$12,ROW(D27)-ROW(D$12),0)=0,\"\",OFFSET(PO!O$12,ROW(D27)-ROW(D$12),0))","v":""},{"$f":"IF($A27<>\"Serviço\",0,ROUND(SUMIF($F$9:$P$9,\"<>\",$F27:$P27),15-13*PO!$X$3))","v":0},0]
[{"$f":"OFFSET(PO!J$12,ROW(A28)-ROW($A$12),0)","v":"Serviço"},{"$f":"IF($A28=0,\"\",OFFSET(PO!K$12,ROW(B28)-ROW(B$12),0))","v":"1.4.1."},{"$f":"IF(OFFSET(PO!N$12,ROW(C28)-ROW(C$12),0)=0,\"\",OFFSET(PO!N$12,ROW(C28)-ROW(C$12),0))","v":"VIGAS EM CONCRETO ARMADO, Fck= 30 Mpa"},{"$f":"IF(OFFSET(PO!O$12,ROW(D28)-ROW(D$12),0)=0,\"\",OFFSET(PO!O$12,ROW(D28)-ROW(D$12),0))","v":"M3"},{"$f":"IF($A28<>\"Serviço\",0,ROUND(SUMIF($F$9:$P$9,\"<>\",$F28:$P28),15-13*PO!$X$3))","v":33.799999999999997},17.100000000000001,14.5,2.2000000000000002]
[{"$f":"OFFSET(PO!J$12,ROW(A29)-ROW($A$12),0)","v":"Nível 2"},{"$f":"IF($A29=0,\"\",OFFSET(PO!K$12,ROW(B29)-ROW(B$12),0))","v":"1.5."},{"$f":"IF(OFFSET(PO!N$12,ROW(C29)-ROW(C$12),0)=0,\"\",OFFSET(PO!N$12,ROW(C29)-ROW(C$12),0))","v":"ESTRUTURA: PILARES"},{"$f":"IF(OFFSET(PO!O$12,ROW(D29)-ROW(D$12),0)=0,\"\",OFFSET(PO!O$12,ROW(D29)-ROW(D$12),0))","v":""},{"$f":"IF($A29<>\"Serviço\",0,ROUND(SUMIF($F$9:$P$9,\"<>\",$F29:$P29),15-13*PO!$X$3))","v":0},0]
[{"$f":"OFFSET(PO!J$12,ROW(A30)-ROW($A$12),0)","v":"Serviço"},{"$f":"IF($A30=0,\"\",OFFSET(PO!K$12,ROW(B30)-ROW(B$12),0))","v":"1.5.1."},{"$f":"IF(OFFSET(PO!N$12,ROW(C30)-ROW(C$12),0)=0,\"\",OFFSET(PO!N$12,ROW(C30)-ROW(C$12),0))","v":"PILARES EM CONCRETO ARMADO, Fck= 30 Mpa"},{"$f":"IF(OFFSET(PO!O$12,ROW(D30)-ROW(D$12),0)=0,\"\",OFFSET(PO!O$12,ROW(D30)-ROW(D$12),0))","v":"M3"},{"$f":"IF($A30<>\"Serviço\",0,ROUND(SUMIF($F$9:$P$9,\"<>\",$F30:$P30),15-13*PO!$X$3))","v":28.6},16.600000000000001,10.3,1.7]
[{"$f":"OFFSET(PO!J$12,ROW(A31)-ROW($A$12),0)","v":"Nível 2"},{"$f":"IF($A31=0,\"\",OFFSET(PO!K$12,ROW(B31)-ROW(B$12),0))","v":"1.6."},{"$f":"IF(OFFSET(PO!N$12,ROW(C31)-ROW(C$12),0)=0,\"\",OFFSET(PO!N$12,ROW(C31)-ROW(C$12),0))","v":"ESTRUTURA: ESCADAS"},{"$f":"IF(OFFSET(PO!O$12,ROW(D31)-ROW(D$12),0)=0,\"\",OFFSET(PO!O$12,ROW(D31)-ROW(D$12),0))","v":""},{"$f":"IF($A31<>\"Serviço\",0,ROUND(SUMIF($F$9:$P$9,\"<>\",$F31:$P31),15-13*PO!$X$3))","v":0},0]
[{"$f":"OFFSET(PO!J$12,ROW(A32)-ROW($A$12),0)","v":"Serviço"},{"$f":"IF($A32=0,\"\",OFFSET(PO!K$12,ROW(B32)-ROW(B$12),0))","v":"1.6.1."},{"$f":"IF(OFFSET(PO!N$12,ROW(C32)-ROW(C$12),0)=0,\"\",OFFSET(PO!N$12,ROW(C32)-ROW(C$12),0))","v":"ESCADAS EM CONCRETO ARMADO, Fck= 30 Mpa"},{"$f":"IF(OFFSET(PO!O$12,ROW(D32)-ROW(D$12),0)=0,\"\",OFFSET(PO!O$12,ROW(D32)-ROW(D$12),0))","v":"M3"},{"$f":"IF($A32<>\"Serviço\",0,ROUND(SUMIF($F$9:$P$9,\"<>\",$F32:$P32),15-13*PO!$X$3))","v":2},2]
[{"$f":"OFFSET(PO!J$12,ROW(A33)-ROW($A$12),0)","v":"Nível 2"},{"$f":"IF($A33=0,\"\",OFFSET(PO!K$12,ROW(B33)-ROW(B$12),0))","v":"1.7."},{"$f":"IF(OFFSET(PO!N$12,ROW(C33)-ROW(C$12),0)=0,\"\",OFFSET(PO!N$12,ROW(C33)-ROW(C$12),0))","v":"LAJES"},{"$f":"IF(OFFSET(PO!O$12,ROW(D33)-ROW(D$12),0)=0,\"\",OFFSET(PO!O$12,ROW(D33)-ROW(D$12),0))","v":""},{"$f":"IF($A33<>\"Serviço\",0,ROUND(SUMIF($F$9:$P$9,\"<>\",$F33:$P33),15-13*PO!$X$3))","v":0},0]
[{"$f":"OFFSET(PO!J$12,ROW(A34)-ROW($A$12),0)","v":"Serviço"},{"$f":"IF($A34=0,\"\",OFFSET(PO!K$12,ROW(B34)-ROW(B$12),0))","v":"1.7.1."},{"$f":"IF(OFFSET(PO!N$12,ROW(C34)-ROW(C$12),0)=0,\"\",OFFSET(PO!N$12,ROW(C34)-ROW(C$12),0))","v":"LAJE NERVURADA, INCLUSIVE FORMAS, LANÇAMENTO, ADENSAMENTO E CAPA EM CONCRETO E= 16 + 4 CM"},{"$f":"IF(OFFSET(PO!O$12,ROW(D34)-ROW(D$12),0)=0,\"\",OFFSET(PO!O$12,ROW(D34)-ROW(D$12),0))","v":"M2"},{"$f":"IF($A34<>\"Serviço\",0,ROUND(SUMIF($F$9:$P$9,\"<>\",$F34:$P34),15-13*PO!$X$3))","v":535.41},272.20999999999998,263.2]
[{"$f":"OFFSET(PO!J$12,ROW(A35)-ROW($A$12),0)","v":"Serviço"},{"$f":"IF($A35=0,\"\",OFFSET(PO!K$12,ROW(B35)-ROW(B$12),0))","v":"1.7.2."},{"$f":"IF(OFFSET(PO!N$12,ROW(C35)-ROW(C$12),0)=0,\"\",OFFSET(PO!N$12,ROW(C35)-ROW(C$12),0))","v":"LAJES EM CONCRETO ARMADO, Fck= 30 Mpa"},{"$f":"IF(OFFSET(PO!O$12,ROW(D35)-ROW(D$12),0)=0,\"\",OFFSET(PO!O$12,ROW(D35)-ROW(D$12),0))","v":"M3"},{"$f":"IF($A35<>\"Serviço\",0,ROUND(SUMIF($F$9:$P$9,\"<>\",$F35:$P35),15-13*PO!$X$3))","v":6.88},3.3,1.36,2.2200000000000002]
[{"$f":"OFFSET(PO!J$12,ROW(A36)-ROW($A$12),0)","v":"Serviço"},{"$f":"IF($A36=0,\"\",OFFSET(PO!K$12,ROW(B36)-ROW(B$12),0))","v":"1.7.3."},{"$f":"IF(OFFSET(PO!N$12,ROW(C36)-ROW(C$12),0)=0,\"\",OFFSET(PO!N$12,ROW(C36)-ROW(C$12),0))","v":"IMPERMEABILIZACAO DE LAJES E MARQUISES DESCOBERTAS, COM MANTA ASFALTICA, 2 CAMADAS, INCLUSIVE APLICAÇÃO DE PRIMER ASFALTICO, ESP= 3mm e 4 mm"},{"$f":"IF(OFFSET(PO!O$12,ROW(D36)-ROW(D$12),0)=0,\"\",OFFSET(PO!O$12,ROW(D36)-ROW(D$12),0))","v":"M2"},{"$f":"IF($A36<>\"Serviço\",0,ROUND(SUMIF($F$9:$P$9,\"<>\",$F36:$P36),15-13*PO!$X$3))","v":50.65},null,null,50.65]
[{"$f":"OFFSET(PO!J$12,ROW(A37)-ROW($A$12),0)","v":"Nível 2"},{"$f":"IF($A37=0,\"\",OFFSET(PO!K$12,ROW(B37)-ROW(B$12),0))","v":"1.8."},{"$f":"IF(OFFSET(PO!N$12,ROW(C37)-ROW(C$12),0)=0,\"\",OFFSET(PO!N$12,ROW(C37)-ROW(C$12),0))","v":"ALVENARIA E FECHAMENTOS"},{"$f":"IF(OFFSET(PO!O$12,ROW(D37)-ROW(D$12),0)=0,\"\",OFFSET(PO!O$12,ROW(D37)-ROW(D$12),0))","v":""},{"$f":"IF($A37<>\"Serviço\",0,ROUND(SUMIF($F$9:$P$9,\"<>\",$F37:$P37),15-13*PO!$X$3))","v":0},0]
[{"$f":"OFFSET(PO!J$12,ROW(A38)-ROW($A$12),0)","v":"Serviço"},{"$f":"IF($A38=0,\"\",OFFSET(PO!K$12,ROW(B38)-ROW(B$12),0))","v":"1.8.1."},{"$f":"IF(OFFSET(PO!N$12,ROW(C38)-ROW(C$12),0)=0,\"\",OFFSET(PO!N$12,ROW(C38)-ROW(C$12),0))","v":"ALVENARIA DE VEDAÇÃO DE BLOCOS CERÂMICOS FURADOS NA VERTICAL DE 14X19X39CM (ESPESSURA 14CM) DE PAREDES E ARGAMASSA DE ASSENTAMENTO "},{"$f":"IF(OFFSET(PO!O$12,ROW(D38)-ROW(D$12),0)=0,\"\",OFFSET(PO!O$12,ROW(D38)-ROW(D$12),0))","v":"M2"},{"$f":"IF($A38<>\"Serviço\",0,ROUND(SUMIF($F$9:$P$9,\"<>\",$F38:$P38),15-13*PO!$X$3))","v":1162.71},517.6,447.53,197.58]
[{"$f":"OFFSET(PO!J$12,ROW(A39)-ROW($A$12),0)","v":"Serviço"},{"$f":"IF($A39=0,\"\",OFFSET(PO!K$12,ROW(B39)-ROW(B$12),0))","v":"1.8.2."},{"$f":"IF(OFFSET(PO!N$12,ROW(C39)-ROW(C$12),0)=0,\"\",OFFSET(PO!N$12,ROW(C39)-ROW(C$12),0))","v":"PAREDE COM PLACAS DE GESSO ACARTONADO (DRYWALL), PARA USO INTERNO COM UMA FACE SIMPLES E OUTRA FACE DUPLA E ESTRUTURA METÁLICA COM GUIAS DUPLAS"},{"$f":"IF(OFFSET(PO!O$12,ROW(D39)-ROW(D$12),0)=0,\"\",OFFSET(PO!O$12,ROW(D39)-ROW(D$12),0))","v":"M2"},{"$f":"IF($A39<>\"Serviço\",0,ROUND(SUMIF($F$9:$P$9,\"<>\",$F39:$P39),15-13*PO!$X$3))","v":49.4},null,49.4]
[{"$f":"OFFSET(PO!J$12,ROW(A40)-ROW($A$12),0)","v":"Serviço"},{"$f":"IF($A40=0,\"\",OFFSET(PO!K$12,ROW(B40)-ROW(B$12),0))","v":"1.8.3."},{"$f":"IF(OFFSET(PO!N$12,ROW(C40)-ROW(C$12),0)=0,\"\",OFFSET(PO!N$12,ROW(C40)-ROW(C$12),0))","v":"DIVISORIA EM MARMORITE ESPESSURA 35MM, CHUMBAMENTO NO PISO E PAREDE COM ARGAMASSA DE CIMENTO E AREIA, POLIMENTO MANUAL"},{"$f":"IF(OFFSET(PO!O$12,ROW(D40)-ROW(D$12),0)=0,\"\",OFFSET(PO!O$12,ROW(D40)-ROW(D$12),0))","v":"M2"},{"$f":"IF($A40<>\"Serviço\",0,ROUND(SUMIF($F$9:$P$9,\"<>\",$F40:$P40),15-13*PO!$X$3))","v":17.38},17.38]
[{"$f":"OFFSET(PO!J$12,ROW(A41)-ROW($A$12),0)","v":"Serviço"},{"$f":"IF($A41=0,\"\",OFFSET(PO!K$12,ROW(B41)-ROW(B$12),0))","v":"1.8.4."},{"$f":"IF(OFFSET(PO!N$12,ROW(C41)-ROW(C$12),0)=0,\"\",OFFSET(PO!N$12,ROW(C41)-ROW(C$12),0))","v":"GUARDA-CORPO COM CORRIMAO EM TUBO DE ACO GALVANIZADO 3/4\""},{"$f":"IF(OFFSET(PO!O$12,ROW(D41)-ROW(D$12),0)=0,\"\",OFFSET(PO!O$12,ROW(D41)-ROW(D$12),0))","v":"M"},{"$f":"IF($A41<>\"Serviço\",0,ROUND(SUMIF($F$9:$P$9,\"<>\",$F41:$P41),15-13*PO!$X$3))","v":10.7},null,10.7]
[{"$f":"OFFSET(PO!J$12,ROW(A42)-ROW($A$12),0)","v":"Serviço"},{"$f":"IF($A42=0,\"\",OFFSET(PO!K$12,ROW(B42)-ROW(B$12),0))","v":"1.8.5."},{"$f":"IF(OFFSET(PO!N$12,ROW(C42)-ROW(C$12),0)=0,\"\",OFFSET(PO!N$12,ROW(C42)-ROW(C$12),0))","v":"CORRIMAO EM TUBO ACO GALVANIZADO 3/4\" COM BRACADEIRA"},{"$f":"IF(OFFSET(PO!O$12,ROW(D42)-ROW(D$12),0)=0,\"\",OFFSET(PO!O$12,ROW(D42)-ROW(D$12),0))","v":"M"},{"$f":"IF($A42<>\"Serviço\",0,ROUND(SUMIF($F$9:$P$9,\"<>\",$F42:$P42),15-13*PO!$X$3))","v":13.56},null,13.56]
[{"$f":"OFFSET(PO!J$12,ROW(A43)-ROW($A$12),0)","v":"Serviço"},{"$f":"IF($A43=0,\"\",OFFSET(PO!K$12,ROW(B43)-ROW(B$12),0))","v":"1.8.6."},{"$f":"IF(OFFSET(PO!N$12,ROW(C43)-ROW(C$12),0)=0,\"\",OFFSET(PO!N$12,ROW(C43)-ROW(C$12),0))","v":"VERGA PRÉ-MOLDADA "},{"$f":"IF(OFFSET(PO!O$12,ROW(D43)-ROW(D$12),0)=0,\"\",OFFSET(PO!O$12,ROW(D43)-ROW(D$12),0))","v":"M"},{"$f":"IF($A43<>\"Serviço\",0,ROUND(SUMIF($F$9:$P$9,\"<>\",$F43:$P43),15-13*PO!$X$3))","v":139.5},68.5,71]
[{"$f":"OFFSET(PO!J$12,ROW(A44)-ROW($A$12),0)","v":"Serviço"},{"$f":"IF($A44=0,\"\",OFFSET(PO!K$12,ROW(B44)-ROW(B$12),0))","v":"1.8.7."},{"$f":"IF(OFFSET(PO!N$12,ROW(C44)-ROW(C$12),0)=0,\"\",OFFSET(PO!N$12,ROW(C44)-ROW(C$12),0))","v":"CONTRAVERGA PRÉ-MOLDADA "},{"$f":"IF(OFFSET(PO!O$12,ROW(D44)-ROW(D$12),0)=0,\"\",OFFSET(PO!O$12,ROW(D44)-ROW(D$12),0))","v":"M"},{"$f":"IF($A44<>\"Serviço\",0,ROUND(SUMIF($F$9:$P$9,\"<>\",$F44:$P44),15-13*PO!$X$3))","v":106.1},47.3,58.8]
[{"$f":"OFFSET(PO!J$12,ROW(A45)-ROW($A$12),0)","v":"Nível 2"},{"$f":"IF($A45=0,\"\",OFFSET(PO!K$12,ROW(B45)-ROW(B$12),0))","v":"1.9."},{"$f":"IF(OFFSET(PO!N$12,ROW(C45)-ROW(C$12),0)=0,\"\",OFFSET(PO!N$12,ROW(C45)-ROW(C$12),0))","v":"REVESTIMENTOS"},{"$f":"IF(OFFSET(PO!O$12,ROW(D45)-ROW(D$12),0)=0,\"\",OFFSET(PO!O$12,ROW(D45)-ROW(D$12),0))","v":""},{"$f":"IF($A45<>\"Serviço\",0,ROUND(SUMIF($F$9:$P$9,\"<>\",$F45:$P45),15-13*PO!$X$3))","v":0},0]
[{"$f":"OFFSET(PO!J$12,ROW(A46)-ROW($A$12),0)","v":"Serviço"},{"$f":"IF($A46=0,\"\",OFFSET(PO!K$12,ROW(B46)-ROW(B$12),0))","v":"1.9.1."},{"$f":"IF(OFFSET(PO!N$12,ROW(C46)-ROW(C$12),0)=0,\"\",OFFSET(PO!N$12,ROW(C46)-ROW(C$12),0))","v":"CHAPISCO APLICADO EM ALVENARIAS E ESTRUTURAS DE CONCRETO, ARGAMASSA TRAÇO 1:3 "},{"$f":"IF(OFFSET(PO!O$12,ROW(D46)-ROW(D$12),0)=0,\"\",OFFSET(PO!O$12,ROW(D46)-ROW(D$12),0))","v":"M2"},{"$f":"IF($A46<>\"Serviço\",0,ROUND(SUMIF($F$9:$P$9,\"<>\",$F46:$P46),15-13*PO!$X$3))","v":2393.23},1080.68,1056.5899999999999,255.96]
[{"$f":"OFFSET(PO!J$12,ROW(A47)-ROW($A$12),0)","v":"Serviço"},{"$f":"IF($A47=0,\"\",OFFSET(PO!K$12,ROW(B47)-ROW(B$12),0))","v":"1.9.2."},{"$f":"IF(OFFSET(PO!N$12,ROW(C47)-ROW(C$12),0)=0,\"\",OFFSET(PO!N$12,ROW(C47)-ROW(C$12),0))","v":"EMBOÇO, PARA RECEBIMENTO DE CERÂMICA, EM ARGAMASSA TRAÇO 1:2:8, ESPESSURA DE 20MM, COM EXECUÇÃO DE TALISCAS"},{"$f":"IF(OFFSET(PO!O$12,ROW(D47)-ROW(D$12),0)=0,\"\",OFFSET(PO!O$12,ROW(D47)-ROW(D$12),0))","v":"M2"},{"$f":"IF($A47<>\"Serviço\",0,ROUND(SUMIF($F$9:$P$9,\"<>\",$F47:$P47),15-13*PO!$X$3))","v":2393.23},1080.68,1056.5899999999999,255.96]
[{"$f":"OFFSET(PO!J$12,ROW(A48)-ROW($A$12),0)","v":"Serviço"},{"$f":"IF($A48=0,\"\",OFFSET(PO!K$12,ROW(B48)-ROW(B$12),0))","v":"1.9.3."},{"$f":"IF(OFFSET(PO!N$12,ROW(C48)-ROW(C$12),0)=0,\"\",OFFSET(PO!N$12,ROW(C48)-ROW(C$12),0))","v":"REVESTIMENTO CERÂMICO PARA PAREDES INTERNAS COM PLACAS TIPO ESMALTADA EXTRA DE DIMENSÕES 33X45 CM ATÉ 2,10m "},{"$f":"IF(OFFSET(PO!O$12,ROW(D48)-ROW(D$12),0)=0,\"\",OFFSET(PO!O$12,ROW(D48)-ROW(D$12),0))","v":"M2"},{"$f":"IF($A48<>\"Serviço\",0,ROUND(SUMIF($F$9:$P$9,\"<>\",$F48:$P48),15-13*PO!$X$3))","v":165.2},134.4,30.8]
[{"$f":"OFFSET(PO!J$12,ROW(A49)-ROW($A$12),0)","v":"Serviço"},{"$f":"IF($A49=0,\"\",OFFSET(PO!K$12,ROW(B49)-ROW(B$12),0))","v":"1.9.4."},{"$f":"IF(OFFSET(PO!N$12,ROW(C49)-ROW(C$12),0)=0,\"\",OFFSET(PO!N$12,ROW(C49)-ROW(C$12),0))","v":"REVESTIMENTO CERÂMICO EM TIJOLETAS LISAS 10x20x2,5CM, ASSENTADAS COM ARGAMASSA DO TIPO ACIII"},{"$f":"IF(OFFSET(PO!O$12,ROW(D49)-ROW(D$12),0)=0,\"\",OFFSET(PO!O$12,ROW(D49)-ROW(D$12),0))","v":"M²"},{"$f":"IF($A49<>\"Serviço\",0,ROUND(SUMIF($F$9:$P$9,\"<>\",$F49:$P49),15-13*PO!$X$3))","v":120.52},25.16,95.36]
[{"$f":"OFFSET(PO!J$12,ROW(A50)-ROW($A$12),0)","v":"Nível 2"},{"$f":"IF($A50=0,\"\",OFFSET(PO!K$12,ROW(B50)-ROW(B$12),0))","v":"1.10."},{"$f":"IF(OFFSET(PO!N$12,ROW(C50)-ROW(C$12),0)=0,\"\",OFFSET(PO!N$12,ROW(C50)-ROW(C$12),0))","v":"COBERTURAS"},{"$f":"IF(OFFSET(PO!O$12,ROW(D50)-ROW(D$12),0)=0,\"\",OFFSET(PO!O$12,ROW(D50)-ROW(D$12),0))","v":""},{"$f":"IF($A50<>\"Serviço\",0,ROUND(SUMIF($F$9:$P$9,\"<>\",$F50:$P50),15-13*PO!$X$3))","v":0},0]
[{"$f":"OFFSET(PO!J$12,ROW(A51)-ROW($A$12),0)","v":"Serviço"},{"$f":"IF($A51=0,\"\",OFFSET(PO!K$12,ROW(B51)-ROW(B$12),0))","v":"1.10.1."},{"$f":"IF(OFFSET(PO!N$12,ROW(C51)-ROW(C$12),0)=0,\"\",OFFSET(PO!N$12,ROW(C51)-ROW(C$12),0))","v":"TELHAMENTO COM TELHA ONDULADA DE FIBROCIMENTO E = 6 MM, COM RECOBRIMENTO LATERAL DE 1/4 DE ONDA, INCLUSO IÇAMENTO"},{"$f":"IF(OFFSET(PO!O$12,ROW(D51)-ROW(D$12),0)=0,\"\",OFFSET(PO!O$12,ROW(D51)-ROW(D$12),0))","v":"M2"},{"$f":"IF($A51<>\"Serviço\",0,ROUND(SUMIF($F$9:$P$9,\"<>\",$F51:$P51),15-13*PO!$X$3))","v":285.57},null,null,285.57]
[{"$f":"OFFSET(PO!J$12,ROW(A52)-ROW($A$12),0)","v":"Serviço"},{"$f":"IF($A52=0,\"\",OFFSET(PO!K$12,ROW(B52)-ROW(B$12),0))","v":"1.10.2."},{"$f":"IF(OFFSET(PO!N$12,ROW(C52)-ROW(C$12),0)=0,\"\",OFFSET(PO!N$12,ROW(C52)-ROW(C$12),0))","v":"CUMEEIRA PARA TELHA DE FIBROCIMENTO ONDULADA E = 6 MM, INCLUSO ACESSÓRIOS DE FIXAÇÃO E IÇAMENTO"},{"$f":"IF(OFFSET(PO!O$12,ROW(D52)-ROW(D$12),0)=0,\"\",OFFSET(PO!O$12,ROW(D52)-ROW(D$12),0))","v":"M"},{"$f":"IF($A52<>\"Serviço\",0,ROUND(SUMIF($F$9:$P$9,\"<>\",$F52:$P52),15-13*PO!$X$3))","v":34.83},null,null,34.83]
[{"$f":"OFFSET(PO!J$12,ROW(A53)-ROW($A$12),0)","v":"Serviço"},{"$f":"IF($A53=0,\"\",OFFSET(PO!K$12,ROW(B53)-ROW(B$12),0))","v":"1.10.3."},{"$f":"IF(OFFSET(PO!N$12,ROW(C53)-ROW(C$12),0)=0,\"\",OFFSET(PO!N$12,ROW(C53)-ROW(C$12),0))","v":"CALHA EM CHAPA DE AÇO GALVANIZADO NÚMERO 24, DESENVOLVIMENTO DE 50 CM, INCLUSO TRANSPORTE VERTICAL"},{"$f":"IF(OFFSET(PO!O$12,ROW(D53)-ROW(D$12),0)=0,\"\",OFFSET(PO!O$12,ROW(D53)-ROW(D$12),0))","v":"M"},{"$f":"IF($A53<>\"Serviço\",0,ROUND(SUMIF($F$9:$P$9,\"<>\",$F53:$P53),15-13*PO!$X$3))","v":73.55},null,null,73.55]
[{"$f":"OFFSET(PO!J$12,ROW(A54)-ROW($A$12),0)","v":"Serviço"},{"$f":"IF($A54=0,\"\",OFFSET(PO!K$12,ROW(B54)-ROW(B$12),0))","v":"1.10.4."},{"$f":"IF(OFFSET(PO!N$12,ROW(C54)-ROW(C$12),0)=0,\"\",OFFSET(PO!N$12,ROW(C54)-ROW(C$12),0))","v":"TRAMA DE MADEIRA COMPOSTA POR TERÇAS PARA TELHADOS TELHA DE FIBROCIMENTO, INCLUSO TRANSPORTE VERTICAL"},{"$f":"IF(OFFSET(PO!O$12,ROW(D54)-ROW(D$12),0)=0,\"\",OFFSET(PO!O$12,ROW(D54)-ROW(D$12),0))","v":"M2"},{"$f":"IF($A54<>\"Serviço\",0,ROUND(SUMIF($F$9:$P$9,\"<>\",$F54:$P54),15-13*PO!$X$3))","v":285.57},null,null,285.57]
[{"$f":"OFFSET(PO!J$12,ROW(A55)-ROW($A$12),0)","v":"Serviço"},{"$f":"IF($A55=0,\"\",OFFSET(PO!K$12,ROW(B55)-ROW(B$12),0))","v":"1.10.5."},{"$f":"IF(OFFSET(PO!N$12,ROW(C55)-ROW(C$12),0)=0,\"\",OFFSET(PO!N$12,ROW(C55)-ROW(C$12),0))","v":"PINGADEIRAS EM CHAPA DE AÇO GALVANIZADO NÚMERO 24, CORTE DE 25 CM, INCLUSO TRANSPORTE VERTICAL"},{"$f":"IF(OFFSET(PO!O$12,ROW(D55)-ROW(D$12),0)=0,\"\",OFFSET(PO!O$12,ROW(D55)-ROW(D$12),0))","v":"M"},{"$f":"IF($A55<>\"Serviço\",0,ROUND(SUMIF($F$9:$P$9,\"<>\",$F55:$P55),15-13*PO!$X$3))","v":121.7},null,null,121.7]
[{"$f":"OFFSET(PO!J$12,ROW(A56)-ROW($A$12),0)","v":"Serviço"},{"$f":"IF($A56=0,\"\",OFFSET(PO!K$12,ROW(B56)-ROW(B$12),0))","v":"1.10.6."},{"$f":"IF(OFFSET(PO!N$12,ROW(C56)-ROW(C$12),0)=0,\"\",OFFSET(PO!N$12,ROW(C56)-ROW(C$12),0))","v":"ESCADA TIPO MARINHEIRO EM ACO CA-50 9,52MM INCLUSO PINTURA COM FUNDO ANTICORROSIVO TIPO ZARCAO"},{"$f":"IF(OFFSET(PO!O$12,ROW(D56)-ROW(D$12),0)=0,\"\",OFFSET(PO!O$12,ROW(D56)-ROW(D$12),0))","v":"M"},{"$f":"IF($A56<>\"Serviço\",0,ROUND(SUMIF($F$9:$P$9,\"<>\",$F56:$P56),15-13*PO!$X$3))","v":4.2},null,null,4.2]
[{"$f":"OFFSET(PO!J$12,ROW(A57)-ROW($A$12),0)","v":"Serviço"},{"$f":"IF($A57=0,\"\",OFFSET(PO!K$12,ROW(B57)-ROW(B$12),0))","v":"1.10.7."},{"$f":"IF(OFFSET(PO!N$12,ROW(C57)-ROW(C$12),0)=0,\"\",OFFSET(PO!N$12,ROW(C57)-ROW(C$12),0))","v":"FORRO EM PLACAS DE GESSO"},{"$f":"IF(OFFSET(PO!O$12,ROW(D57)-ROW(D$12),0)=0,\"\",OFFSET(PO!O$12,ROW(D57)-ROW(D$12),0))","v":"M2"},{"$f":"IF($A57<>\"Serviço\",0,ROUND(SUMIF($F$9:$P$9,\"<>\",$F57:$P57),15-13*PO!$X$3))","v":425.12},191.71,233.41]
[{"$f":"OFFSET(PO!J$12,ROW(A58)-ROW($A$12),0)","v":"Nível 2"},{"$f":"IF($A58=0,\"\",OFFSET(PO!K$12,ROW(B58)-ROW(B$12),0))","v":"1.11."},{"$f":"IF(OFFSET(PO!N$12,ROW(C58)-ROW(C$12),0)=0,\"\",OFFSET(PO!N$12,ROW(C58)-ROW(C$12),0))","v":"ESQUADRIAS"},{"$f":"IF(OFFSET(PO!O$12,ROW(D58)-ROW(D$12),0)=0,\"\",OFFSET(PO!O$12,ROW(D58)-ROW(D$12),0))","v":""},{"$f":"IF($A58<>\"Serviço\",0,ROUND(SUMIF($F$9:$P$9,\"<>\",$F58:$P58),15-13*PO!$X$3))","v":0},0]
[{"$f":"OFFSET(PO!J$12,ROW(A59)-ROW($A$12),0)","v":"Serviço"},{"$f":"IF($A59=0,\"\",OFFSET(PO!K$12,ROW(B59)-ROW(B$12),0))","v":"1.11.1."},{"$f":"IF(OFFSET(PO!N$12,ROW(C59)-ROW(C$12),0)=0,\"\",OFFSET(PO!N$12,ROW(C59)-ROW(C$12),0))","v":"PORTA DE MADEIRA PARA PINTURA, SEMI-OCA (LEVE OU MÉDIA), PADRÃO MÉDIO, 90X210CM, ESPESSURA DE 3,5CM, ITENS INCLUSOS: DOBRADIÇAS, MONTAGEM E INSTALAÇÃO DO BATENTE, FECHADURA COM EXECUÇÃO DO FURO - FORNECIMENTO E INSTALAÇÃO"},{"$f":"IF(OFFSET(PO!O$12,ROW(D59)-ROW(D$12),0)=0,\"\",OFFSET(PO!O$12,ROW(D59)-ROW(D$12),0))","v":"UN"},{"$f":"IF($A59<>\"Serviço\",0,ROUND(SUMIF($F$9:$P$9,\"<>\",$F59:$P59),15-13*PO!$X$3))","v":12},6,6]
[{"$f":"OFFSET(PO!J$12,ROW(A60)-ROW($A$12),0)","v":"Serviço"},{"$f":"IF($A60=0,\"\",OFFSET(PO!K$12,ROW(B60)-ROW(B$12),0))","v":"1.11.2."},{"$f":"IF(OFFSET(PO!N$12,ROW(C60)-ROW(C$12),0)=0,\"\",OFFSET(PO!N$12,ROW(C60)-ROW(C$12),0))","v":"PORTA EM VIDRO TEMPERADO FUME E=10mm, COM PERFIL DE ALUMINIO, CORES VARIADAS, DE GIRAR 2,40 X 2,10M"},{"$f":"IF(OFFSET(PO!O$12,ROW(D60)-ROW(D$12),0)=0,\"\",OFFSET(PO!O$12,ROW(D60)-ROW(D$12),0))","v":"UNID"},{"$f":"IF($A60<>\"Serviço\",0,ROUND(SUMIF($F$9:$P$9,\"<>\",$F60:$P60),15-13*PO!$X$3))","v":2},2]
[{"$f":"OFFSET(PO!J$12,ROW(A61)-ROW($A$12),0)","v":"Serviço"},{"$f":"IF($A61=0,\"\",OFFSET(PO!K$12,ROW(B61)-ROW(B$12),0))","v":"1.11.3."},{"$f":"IF(OFFSET(PO!N$12,ROW(C61)-ROW(C$12),0)=0,\"\",OFFSET(PO!N$12,ROW(C61)-ROW(C$12),0))","v":"PORTA MADEIRA 1A CORRER P/VIDRO 30MM/ GUARNICAO 15CM/ALIZAR"},{"$f":"IF(OFFSET(PO!O$12,ROW(D61)-ROW(D$12),0)=0,\"\",OFFSET(PO!O$12,ROW(D61)-ROW(D$12),0))","v":"M2"},{"$f":"IF($A61<>\"Serviço\",0,ROUND(SUMIF($F$9:$P$9,\"<>\",$F61:$P61),15-13*PO!$X$3))","v":8.4},4.2,4.2]
[{"$f":"OFFSET(PO!J$12,ROW(A62)-ROW($A$12),0)","v":"Serviço"},{"$f":"IF($A62=0,\"\",OFFSET(PO!K$12,ROW(B62)-ROW(B$12),0))","v":"1.11.4."},{"$f":"IF(OFFSET(PO!N$12,ROW(C62)-ROW(C$12),0)=0,\"\",OFFSET(PO!N$12,ROW(C62)-ROW(C$12),0))","v":"PORTA EM VIDRO TEMPERADO FUME E=10mm, COM PERFIL DE ALUMINIO, CORES VARIADAS, DE GIRAR  2,40 X 3,00M"},{"$f":"IF(OFFSET(PO!O$12,ROW(D62)-ROW(D$12),0)=0,\"\",OFFSET(PO!O$12,ROW(D62)-ROW(D$12),0))","v":"UNID"},{"$f":"IF($A62<>\"Serviço\",0,ROUND(SUMIF($F$9:$P$9,\"<>\",$F62:$P62),15-13*PO!$X$3))","v":1},1]
[{"$f":"OFFSET(PO!J$12,ROW(A63)-ROW($A$12),0)","v":"Serviço"},{"$f":"IF($A63=0,\"\",OFFSET(PO!K$12,ROW(B63)-ROW(B$12),0))","v":"1.11.5."},{"$f":"IF(OFFSET(PO!N$12,ROW(C63)-ROW(C$12),0)=0,\"\",OFFSET(PO!N$12,ROW(C63)-ROW(C$12),0))","v":"PORTA DE ABRIR EM ALUMINIO TIPO VENEZIANA, ACABAMENTO ANODIZADO NATURAL, SEM GUARNICAO/ALIZAR/VISTA"},{"$f":"IF(OFFSET(PO!O$12,ROW(D63)-ROW(D$12),0)=0,\"\",OFFSET(PO!O$12,ROW(D63)-ROW(D$12),0))","v":"M2"},{"$f":"IF($A63<>\"Serviço\",0,ROUND(SUMIF($F$9:$P$9,\"<>\",$F63:$P63),15-13*PO!$X$3))","v":9.6},9.6]
[{"$f":"OFFSET(PO!J$12,ROW(A64)-ROW($A$12),0)","v":"Serviço"},{"$f":"IF($A64=0,\"\",OFFSET(PO!K$12,ROW(B64)-ROW(B$12),0))","v":"1.11.6."},{"$f":"IF(OFFSET(PO!N$12,ROW(C64)-ROW(C$12),0)=0,\"\",OFFSET(PO!N$12,ROW(C64)-ROW(C$12),0))","v":"JANELA DE ALUMÍNIO MAXIM-AR, FIXAÇÃO COM ARGAMASSA, COM VIDROS, PADRONIZADA"},{"$f":"IF(OFFSET(PO!O$12,ROW(D64)-ROW(D$12),0)=0,\"\",OFFSET(PO!O$12,ROW(D64)-ROW(D$12),0))","v":"M2"},{"$f":"IF($A64<>\"Serviço\",0,ROUND(SUMIF($F$9:$P$9,\"<>\",$F64:$P64),15-13*PO!$X$3))","v":151.4},63.3,88.1]
[{"$f":"OFFSET(PO!J$12,ROW(A65)-ROW($A$12),0)","v":"Serviço"},{"$f":"IF($A65=0,\"\",OFFSET(PO!K$12,ROW(B65)-ROW(B$12),0))","v":"1.11.7."},{"$f":"IF(OFFSET(PO!N$12,ROW(C65)-ROW(C$12),0)=0,\"\",OFFSET(PO!N$12,ROW(C65)-ROW(C$12),0))","v":"JANELA FIXA EM ALUMINIO, 60  X 80 CM (A X L), BATENTE/REQUADRO DE 3 A 14 CM, COM VIDRO"},{"$f":"IF(OFFSET(PO!O$12,ROW(D65)-ROW(D$12),0)=0,\"\",OFFSET(PO!O$12,ROW(D65)-ROW(D$12),0))","v":"M2"},{"$f":"IF($A65<>\"Serviço\",0,ROUND(SUMIF($F$9:$P$9,\"<>\",$F65:$P65),15-13*PO!$X$3))","v":4.5},4.5]
[{"$f":"OFFSET(PO!J$12,ROW(A66)-ROW($A$12),0)","v":"Serviço"},{"$f":"IF($A66=0,\"\",OFFSET(PO!K$12,ROW(B66)-ROW(B$12),0))","v":"1.11.8."},{"$f":"IF(OFFSET(PO!N$12,ROW(C66)-ROW(C$12),0)=0,\"\",OFFSET(PO!N$12,ROW(C66)-ROW(C$12),0))","v":"SOLEIRA EM MARMORE, POLIDO, L= *15* CM, E=  *2* CM,  CORTE RETO"},{"$f":"IF(OFFSET(PO!O$12,ROW(D66)-ROW(D$12),0)=0,\"\",OFFSET(PO!O$12,ROW(D66)-ROW(D$12),0))","v":"M"},{"$f":"IF($A66<>\"Serviço\",0,ROUND(SUMIF($F$9:$P$9,\"<>\",$F66:$P66),15-13*PO!$X$3))","v":22},14.6,7.4]
[{"$f":"OFFSET(PO!J$12,ROW(A67)-ROW($A$12),0)","v":"Serviço"},{"$f":"IF($A67=0,\"\",OFFSET(PO!K$12,ROW(B67)-ROW(B$12),0))","v":"1.11.9."},{"$f":"IF(OFFSET(PO!N$12,ROW(C67)-ROW(C$12),0)=0,\"\",OFFSET(PO!N$12,ROW(C67)-ROW(C$12),0))","v":"PEITORIL EM MARMORE, POLIDO, L= *15* CM, E=  *2* CM,  CORTE RETO"},{"$f":"IF(OFFSET(PO!O$12,ROW(D67)-ROW(D$12),0)=0,\"\",OFFSET(PO!O$12,ROW(D67)-ROW(D$12),0))","v":"M"},{"$f":"IF($A67<>\"Serviço\",0,ROUND(SUMIF($F$9:$P$9,\"<>\",$F67:$P67),15-13*PO!$X$3))","v":95.3},41.3,54]
[{"$f":"OFFSET(PO!J$12,ROW(A68)-ROW($A$12),0)","v":"Nível 2"},{"$f":"IF($A68=0,\"\",OFFSET(PO!K$12,ROW(B68)-ROW(B$12),0))","v":"1.12."},{"$f":"IF(OFFSET(PO!N$12,ROW(C68)-ROW(C$12),0)=0,\"\",OFFSET(PO!N$12,ROW(C68)-ROW(C$12),0))","v":"PAVIMENTAÇÕES"},{"$f":"IF(OFFSET(PO!O$12,ROW(D68)-ROW(D$12),0)=0,\"\",OFFSET(PO!O$12,ROW(D68)-ROW(D$12),0))","v":""},{"$f":"IF($A68<>\"Serviço\",0,ROUND(SUMIF($F$9:$P$9,\"<>\",$F68:$P68),15-13*PO!$X$3))","v":0},0]
[{"$f":"OFFSET(PO!J$12,ROW(A69)-ROW($A$12),0)","v":"Serviço"},{"$f":"IF($A69=0,\"\",OFFSET(PO!K$12,ROW(B69)-ROW(B$12),0))","v":"1.12.1."},{"$f":"IF(OFFSET(PO!N$12,ROW(C69)-ROW(C$12),0)=0,\"\",OFFSET(PO!N$12,ROW(C69)-ROW(C$12),0))","v":"PEDRA BRITADA N. 2 PARA LASTRO"},{"$f":"IF(OFFSET(PO!O$12,ROW(D69)-ROW(D$12),0)=0,\"\",OFFSET(PO!O$12,ROW(D69)-ROW(D$12),0))","v":"M3"},{"$f":"IF($A69<>\"Serviço\",0,ROUND(SUMIF($F$9:$P$9,\"<>\",$F69:$P69),15-13*PO!$X$3))","v":19.940000000000001},19.940000000000001]
[{"$f":"OFFSET(PO!J$12,ROW(A70)-ROW($A$12),0)","v":"Serviço"},{"$f":"IF($A70=0,\"\",OFFSET(PO!K$12,ROW(B70)-ROW(B$12),0))","v":"1.12.2."},{"$f":"IF(OFFSET(PO!N$12,ROW(C70)-ROW(C$12),0)=0,\"\",OFFSET(PO!N$12,ROW(C70)-ROW(C$12),0))","v":"PISO EM CONCRETO 20 MPA PREPARO MECANICO, ESPESSURA 7CM, INCLUSO SELANTE ELASTICO A BASE DE POLIURETANO"},{"$f":"IF(OFFSET(PO!O$12,ROW(D70)-ROW(D$12),0)=0,\"\",OFFSET(PO!O$12,ROW(D70)-ROW(D$12),0))","v":"M2"},{"$f":"IF($A70<>\"Serviço\",0,ROUND(SUMIF($F$9:$P$9,\"<>\",$F70:$P70),15-13*PO!$X$3))","v":398.89},398.89]
[{"$f":"OFFSET(PO!J$12,ROW(A71)-ROW($A$12),0)","v":"Serviço"},{"$f":"IF($A71=0,\"\",OFFSET(PO!K$12,ROW(B71)-ROW(B$12),0))","v":"1.12.3."},{"$f":"IF(OFFSET(PO!N$12,ROW(C71)-ROW(C$12),0)=0,\"\",OFFSET(PO!N$12,ROW(C71)-ROW(C$12),0))","v":"CONTRAPISO EM ARGAMASSA TRAÇO 1:4 (CIMENTO E AREIA), ADERIDO, ESPESSURA 3CM"},{"$f":"IF(OFFSET(PO!O$12,ROW(D71)-ROW(D$12),0)=0,\"\",OFFSET(PO!O$12,ROW(D71)-ROW(D$12),0))","v":"M2"},{"$f":"IF($A71<>\"Serviço\",0,ROUND(SUMIF($F$9:$P$9,\"<>\",$F71:$P71),15-13*PO!$X$3))","v":580.91999999999996},282.35000000000002,298.57]
[{"$f":"OFFSET(PO!J$12,ROW(A72)-ROW($A$12),0)","v":"Serviço"},{"$f":"IF($A72=0,\"\",OFFSET(PO!K$12,ROW(B72)-ROW(B$12),0))","v":"1.12.4."},{"$f":"IF(OFFSET(PO!N$12,ROW(C72)-ROW(C$12),0)=0,\"\",OFFSET(PO!N$12,ROW(C72)-ROW(C$12),0))","v":"REVESTIMENTO CERÂMICO PARA PISO COM PLACAS TIPO ESMALTADA EXTRA DE DIMENSÕES 60X60 CM "},{"$f":"IF(OFFSET(PO!O$12,ROW(D72)-ROW(D$12),0)=0,\"\",OFFSET(PO!O$12,ROW(D72)-ROW(D$12),0))","v":"M2"},{"$f":"IF($A72<>\"Serviço\",0,ROUND(SUMIF($F$9:$P$9,\"<>\",$F72:$P72),15-13*PO!$X$3))","v":568.20000000000005},279.95,288.25]
[{"$f":"OFFSET(PO!J$12,ROW(A73)-ROW($A$12),0)","v":"Serviço"},{"$f":"IF($A73=0,\"\",OFFSET(PO!K$12,ROW(B73)-ROW(B$12),0))","v":"1.12.5."},{"$f":"IF(OFFSET(PO!N$12,ROW(C73)-ROW(C$12),0)=0,\"\",OFFSET(PO!N$12,ROW(C73)-ROW(C$12),0))","v":"RODAPÉ CERÂMICO DE 7CM DE ALTURA COM PLACAS TIPO ESMALTADA EXTRA DE DIMENSÕES 60X60CM"},{"$f":"IF(OFFSET(PO!O$12,ROW(D73)-ROW(D$12),0)=0,\"\",OFFSET(PO!O$12,ROW(D73)-ROW(D$12),0))","v":"M"},{"$f":"IF($A73<>\"Serviço\",0,ROUND(SUMIF($F$9:$P$9,\"<>\",$F73:$P73),15-13*PO!$X$3))","v":362.65},166.91,195.74]
[{"$f":"OFFSET(PO!J$12,ROW(A74)-ROW($A$12),0)","v":"Nível 2"},{"$f":"IF($A74=0,\"\",OFFSET(PO!K$12,ROW(B74)-ROW(B$12),0))","v":"1.13."},{"$f":"IF(OFFSET(PO!N$12,ROW(C74)-ROW(C$12),0)=0,\"\",OFFSET(PO!N$12,ROW(C74)-ROW(C$12),0))","v":"PINTURAS"},{"$f":"IF(OFFSET(PO!O$12,ROW(D74)-ROW(D$12),0)=0,\"\",OFFSET(PO!O$12,ROW(D74)-ROW(D$12),0))","v":""},{"$f":"IF($A74<>\"Serviço\",0,ROUND(SUMIF($F$9:$P$9,\"<>\",$F74:$P74),15-13*PO!$X$3))","v":0},0]
[{"$f":"OFFSET(PO!J$12,ROW(A75)-ROW($A$12),0)","v":"Serviço"},{"$f":"IF($A75=0,\"\",OFFSET(PO!K$12,ROW(B75)-ROW(B$12),0))","v":"1.13.1."},{"$f":"IF(OFFSET(PO!N$12,ROW(C75)-ROW(C$12),0)=0,\"\",OFFSET(PO!N$12,ROW(C75)-ROW(C$12),0))","v":"APLICAÇÃO MANUAL DE MASSA ACRÍLICA, DUAS DEMÃOS"},{"$f":"IF(OFFSET(PO!O$12,ROW(D75)-ROW(D$12),0)=0,\"\",OFFSET(PO!O$12,ROW(D75)-ROW(D$12),0))","v":"M2"},{"$f":"IF($A75<>\"Serviço\",0,ROUND(SUMIF($F$9:$P$9,\"<>\",$F75:$P75),15-13*PO!$X$3))","v":2666.12},{"$f":"921.12+279.95","v":1201.07},{"$f":"930.43+335.59","v":1266.02},199.03]
[{"$f":"OFFSET(PO!J$12,ROW(A76)-ROW($A$12),0)","v":"Serviço"},{"$f":"IF($A76=0,\"\",OFFSET(PO!K$12,ROW(B76)-ROW(B$12),0))","v":"1.13.2."},{"$f":"IF(OFFSET(PO!N$12,ROW(C76)-ROW(C$12),0)=0,\"\",OFFSET(PO!N$12,ROW(C76)-ROW(C$12),0))","v":"APLICAÇÃO MANUAL DE PINTURA COM TINTA LÁTEX ACRÍLICA EM TETO, DUAS DEMÃOS"},{"$f":"IF(OFFSET(PO!O$12,ROW(D76)-ROW(D$12),0)=0,\"\",OFFSET(PO!O$12,ROW(D76)-ROW(D$12),0))","v":"M2"},{"$f":"IF($A76<>\"Serviço\",0,ROUND(SUMIF($F$9:$P$9,\"<>\",$F76:$P76),15-13*PO!$X$3))","v":190.42},88.24,102.18]
[{"$f":"OFFSET(PO!J$12,ROW(A77)-ROW($A$12),0)","v":"Serviço"},{"$f":"IF($A77=0,\"\",OFFSET(PO!K$12,ROW(B77)-ROW(B$12),0))","v":"1.13.3."},{"$f":"IF(OFFSET(PO!N$12,ROW(C77)-ROW(C$12),0)=0,\"\",OFFSET(PO!N$12,ROW(C77)-ROW(C$12),0))","v":"APLICAÇÃO MANUAL DE PINTURA COM TINTA LÁTEX ACRÍLICA EM PAREDES, DUAS DEMÃOS"},{"$f":"IF(OFFSET(PO!O$12,ROW(D77)-ROW(D$12),0)=0,\"\",OFFSET(PO!O$12,ROW(D77)-ROW(D$12),0))","v":"M2"},{"$f":"IF($A77<>\"Serviço\",0,ROUND(SUMIF($F$9:$P$9,\"<>\",$F77:$P77),15-13*PO!$X$3))","v":2050.58},921.12,930.43,199.03]
[{"$f":"OFFSET(PO!J$12,ROW(A78)-ROW($A$12),0)","v":"Serviço"},{"$f":"IF($A78=0,\"\",OFFSET(PO!K$12,ROW(B78)-ROW(B$12),0))","v":"1.13.4."},{"$f":"IF(OFFSET(PO!N$12,ROW(C78)-ROW(C$12),0)=0,\"\",OFFSET(PO!N$12,ROW(C78)-ROW(C$12),0))","v":"APLICAÇÃO DE FUNDO SELADOR LÁTEX PVA EM TETO, UMA DEMÃO"},{"$f":"IF(OFFSET(PO!O$12,ROW(D78)-ROW(D$12),0)=0,\"\",OFFSET(PO!O$12,ROW(D78)-ROW(D$12),0))","v":"M2"},{"$f":"IF($A78<>\"Serviço\",0,ROUND(SUMIF($F$9:$P$9,\"<>\",$F78:$P78),15-13*PO!$X$3))","v":190.42},88.24,102.18]
[{"$f":"OFFSET(PO!J$12,ROW(A79)-ROW($A$12),0)","v":"Serviço"},{"$f":"IF($A79=0,\"\",OFFSET(PO!K$12,ROW(B79)-ROW(B$12),0))","v":"1.13.5."},{"$f":"IF(OFFSET(PO!N$12,ROW(C79)-ROW(C$12),0)=0,\"\",OFFSET(PO!N$12,ROW(C79)-ROW(C$12),0))","v":"APLICAÇÃO DE FUNDO SELADOR LÁTEX PVA EM PAREDES, UMA DEMÃO"},{"$f":"IF(OFFSET(PO!O$12,ROW(D79)-ROW(D$12),0)=0,\"\",OFFSET(PO!O$12,ROW(D79)-ROW(D$12),0))","v":"M2"},{"$f":"IF($A79<>\"Serviço\",0,ROUND(SUMIF($F$9:$P$9,\"<>\",$F79:$P79),15-13*PO!$X$3))","v":2050.58},921.12,930.43,199.03]
[{"$f":"OFFSET(PO!J$12,ROW(A80)-ROW($A$12),0)","v":"Serviço"},{"$f":"IF($A80=0,\"\",OFFSET(PO!K$12,ROW(B80)-ROW(B$12),0))","v":"1.13.6."},{"$f":"IF(OFFSET(PO!N$12,ROW(C80)-ROW(C$12),0)=0,\"\",OFFSET(PO!N$12,ROW(C80)-ROW(C$12),0))","v":"PINTURA ESMALTE ACETINADO EM MADEIRA, DUAS DEMAOS"},{"$f":"IF(OFFSET(PO!O$12,ROW(D80)-ROW(D$12),0)=0,\"\",OFFSET(PO!O$12,ROW(D80)-ROW(D$12),0))","v":"M2"},{"$f":"IF($A80<>\"Serviço\",0,ROUND(SUMIF($F$9:$P$9,\"<>\",$F80:$P80),15-13*PO!$X$3))","v":93.24},46.62,46.62]
[{"$f":"OFFSET(PO!J$12,ROW(A81)-ROW($A$12),0)","v":"Nível 2"},{"$f":"IF($A81=0,\"\",OFFSET(PO!K$12,ROW(B81)-ROW(B$12),0))","v":"1.14."},{"$f":"IF(OFFSET(PO!N$12,ROW(C81)-ROW(C$12),0)=0,\"\",OFFSET(PO!N$12,ROW(C81)-ROW(C$12),0))","v":"APARELHOS SANITÁRIOS"},{"$f":"IF(OFFSET(PO!O$12,ROW(D81)-ROW(D$12),0)=0,\"\",OFFSET(PO!O$12,ROW(D81)-ROW(D$12),0))","v":""},{"$f":"IF($A81<>\"Serviço\",0,ROUND(SUMIF($F$9:$P$9,\"<>\",$F81:$P81),15-13*PO!$X$3))","v":0},0]
[{"$f":"OFFSET(PO!J$12,ROW(A82)-ROW($A$12),0)","v":"Serviço"},{"$f":"IF($A82=0,\"\",OFFSET(PO!K$12,ROW(B82)-ROW(B$12),0))","v":"1.14.1."},{"$f":"IF(OFFSET(PO!N$12,ROW(C82)-ROW(C$12),0)=0,\"\",OFFSET(PO!N$12,ROW(C82)-ROW(C$12),0))","v":"LAVATÓRIO LOUÇA BRANCA SUSPENSO, 29,5 X 39CM OU EQUIVALENTE, INCLUSO SIFÃO FLEXÍVEL EM PVC, VÁLVULA E ENGATE FLEXÍVEL 30CM EM PLÁSTICO E TORNEIRA CROMADA DE MESA FORNECIMENTO E INSTALAÇÃO"},{"$f":"IF(OFFSET(PO!O$12,ROW(D82)-ROW(D$12),0)=0,\"\",OFFSET(PO!O$12,ROW(D82)-ROW(D$12),0))","v":"UN"},{"$f":"IF($A82<>\"Serviço\",0,ROUND(SUMIF($F$9:$P$9,\"<>\",$F82:$P82),15-13*PO!$X$3))","v":4},2,2]
[{"$f":"OFFSET(PO!J$12,ROW(A83)-ROW($A$12),0)","v":"Serviço"},{"$f":"IF($A83=0,\"\",OFFSET(PO!K$12,ROW(B83)-ROW(B$12),0))","v":"1.14.2."},{"$f":"IF(OFFSET(PO!N$12,ROW(C83)-ROW(C$12),0)=0,\"\",OFFSET(PO!N$12,ROW(C83)-ROW(C$12),0))","v":"BANCADA DE GRANITO CINZA POLIDO PARA LAVATÓRIO 0,50 X 0,60 M - FORNECIMENTO E INSTALAÇÃO"},{"$f":"IF(OFFSET(PO!O$12,ROW(D83)-ROW(D$12),0)=0,\"\",OFFSET(PO!O$12,ROW(D83)-ROW(D$12),0))","v":"UN"},{"$f":"IF($A83<>\"Serviço\",0,ROUND(SUMIF($F$9:$P$9,\"<>\",$F83:$P83),15-13*PO!$X$3))","v":6},6]
[{"$f":"OFFSET(PO!J$12,ROW(A84)-ROW($A$12),0)","v":"Serviço"},{"$f":"IF($A84=0,\"\",OFFSET(PO!K$12,ROW(B84)-ROW(B$12),0))","v":"1.14.3."},{"$f":"IF(OFFSET(PO!N$12,ROW(C84)-ROW(C$12),0)=0,\"\",OFFSET(PO!N$12,ROW(C84)-ROW(C$12),0))","v":"LAVATORIO/CUBA DE SOBREPOR RETANGULAR LOUCA BRANCA COM LADRAO *52 X 45* CM"},{"$f":"IF(OFFSET(PO!O$12,ROW(D84)-ROW(D$12),0)=0,\"\",OFFSET(PO!O$12,ROW(D84)-ROW(D$12),0))","v":"UN"},{"$f":"IF($A84<>\"Serviço\",0,ROUND(SUMIF($F$9:$P$9,\"<>\",$F84:$P84),15-13*PO!$X$3))","v":6},6]
[{"$f":"OFFSET(PO!J$12,ROW(A85)-ROW($A$12),0)","v":"Serviço"},{"$f":"IF($A85=0,\"\",OFFSET(PO!K$12,ROW(B85)-ROW(B$12),0))","v":"1.14.4."},{"$f":"IF(OFFSET(PO!N$12,ROW(C85)-ROW(C$12),0)=0,\"\",OFFSET(PO!N$12,ROW(C85)-ROW(C$12),0))","v":"SIFÃO DO TIPO FLEXÍVEL EM PVC 1\u0094 X 1.1/2\u0094 - FORNECIMENTO E INSTALAÇÃO"},{"$f":"IF(OFFSET(PO!O$12,ROW(D85)-ROW(D$12),0)=0,\"\",OFFSET(PO!O$12,ROW(D85)-ROW(D$12),0))","v":"UN"},{"$f":"IF($A85<>\"Serviço\",0,ROUND(SUMIF($F$9:$P$9,\"<>\",$F85:$P85),15-13*PO!$X$3))","v":6},6]
[{"$f":"OFFSET(PO!J$12,ROW(A86)-ROW($A$12),0)","v":"Serviço"},{"$f":"IF($A86=0,\"\",OFFSET(PO!K$12,ROW(B86)-ROW(B$12),0))","v":"1.14.5."},{"$f":"IF(OFFSET(PO!N$12,ROW(C86)-ROW(C$12),0)=0,\"\",OFFSET(PO!N$12,ROW(C86)-ROW(C$12),0))","v":"ENGATE FLEXÍVEL EM INOX, 1/2\u0094 X 30CM - FORNECIMENTO E INSTALAÇÃO"},{"$f":"IF(OFFSET(PO!O$12,ROW(D86)-ROW(D$12),0)=0,\"\",OFFSET(PO!O$12,ROW(D86)-ROW(D$12),0))","v":"UN"},{"$f":"IF($A86<>\"Serviço\",0,ROUND(SUMIF($F$9:$P$9,\"<>\",$F86:$P86),15-13*PO!$X$3))","v":6},6]
[{"$f":"OFFSET(PO!J$12,ROW(A87)-ROW($A$12),0)","v":"Serviço"},{"$f":"IF($A87=0,\"\",OFFSET(PO!K$12,ROW(B87)-ROW(B$12),0))","v":"1.14.6."},{"$f":"IF(OFFSET(PO!N$12,ROW(C87)-ROW(C$12),0)=0,\"\",OFFSET(PO!N$12,ROW(C87)-ROW(C$12),0))","v":"VASO SANITARIO SIFONADO CONVENCIONAL PARA PCD COM LOUÇA BRANCA SEM ASSENTO, INCLUSO CONJUNTO DE LIGAÇÃO PARA BACIA SANITÁRIA AJUSTÁVEL - FORNECIMENTO E INSTALAÇÃO"},{"$f":"IF(OFFSET(PO!O$12,ROW(D87)-ROW(D$12),0)=0,\"\",OFFSET(PO!O$12,ROW(D87)-ROW(D$12),0))","v":"UN"},{"$f":"IF($A87<>\"Serviço\",0,ROUND(SUMIF($F$9:$P$9,\"<>\",$F87:$P87),15-13*PO!$X$3))","v":4},2,2]
[{"$f":"OFFSET(PO!J$12,ROW(A88)-ROW($A$12),0)","v":"Serviço"},{"$f":"IF($A88=0,\"\",OFFSET(PO!K$12,ROW(B88)-ROW(B$12),0))","v":"1.14.7."},{"$f":"IF(OFFSET(PO!N$12,ROW(C88)-ROW(C$12),0)=0,\"\",OFFSET(PO!N$12,ROW(C88)-ROW(C$12),0))","v":"VASO SANITÁRIO SIFONADO COM CAIXA ACOPLADA LOUÇA BRANCA - FORNECIMENTO E INSTALAÇÃO"},{"$f":"IF(OFFSET(PO!O$12,ROW(D88)-ROW(D$12),0)=0,\"\",OFFSET(PO!O$12,ROW(D88)-ROW(D$12),0))","v":"UN"},{"$f":"IF($A88<>\"Serviço\",0,ROUND(SUMIF($F$9:$P$9,\"<>\",$F88:$P88),15-13*PO!$X$3))","v":6},6]
[{"$f":"OFFSET(PO!J$12,ROW(A89)-ROW($A$12),0)","v":"Serviço"},{"$f":"IF($A89=0,\"\",OFFSET(PO!K$12,ROW(B89)-ROW(B$12),0))","v":"1.14.8."},{"$f":"IF(OFFSET(PO!N$12,ROW(C89)-ROW(C$12),0)=0,\"\",OFFSET(PO!N$12,ROW(C89)-ROW(C$12),0))","v":"TORNEIRA CROMADA DE MESA PARA LAVATORIO COM SENSOR DE PRESENCA"},{"$f":"IF(OFFSET(PO!O$12,ROW(D89)-ROW(D$12),0)=0,\"\",OFFSET(PO!O$12,ROW(D89)-ROW(D$12),0))","v":"UN"},{"$f":"IF($A89<>\"Serviço\",0,ROUND(SUMIF($F$9:$P$9,\"<>\",$F89:$P89),15-13*PO!$X$3))","v":10},8,2]
[{"$f":"OFFSET(PO!J$12,ROW(A90)-ROW($A$12),0)","v":"Serviço"},{"$f":"IF($A90=0,\"\",OFFSET(PO!K$12,ROW(B90)-ROW(B$12),0))","v":"1.14.9."},{"$f":"IF(OFFSET(PO!N$12,ROW(C90)-ROW(C$12),0)=0,\"\",OFFSET(PO!N$12,ROW(C90)-ROW(C$12),0))","v":"PAPELEIRA PLASTICA TIPO DISPENSER PARA PAPEL HIGIENICO ROLAO"},{"$f":"IF(OFFSET(PO!O$12,ROW(D90)-ROW(D$12),0)=0,\"\",OFFSET(PO!O$12,ROW(D90)-ROW(D$12),0))","v":"UN"},{"$f":"IF($A90<>\"Serviço\",0,ROUND(SUMIF($F$9:$P$9,\"<>\",$F90:$P90),15-13*PO!$X$3))","v":6},6]
[{"$f":"OFFSET(PO!J$12,ROW(A91)-ROW($A$12),0)","v":"Serviço"},{"$f":"IF($A91=0,\"\",OFFSET(PO!K$12,ROW(B91)-ROW(B$12),0))","v":"1.14.10."},{"$f":"IF(OFFSET(PO!N$12,ROW(C91)-ROW(C$12),0)=0,\"\",OFFSET(PO!N$12,ROW(C91)-ROW(C$12),0))","v":"SABONETEIRA PLASTICA TIPO DISPENSER PARA SABONETE LIQUIDO COM RESERVATORIO 800 A 1500 ML"},{"$f":"IF(OFFSET(PO!O$12,ROW(D91)-ROW(D$12),0)=0,\"\",OFFSET(PO!O$12,ROW(D91)-ROW(D$12),0))","v":"UN"},{"$f":"IF($A91<>\"Serviço\",0,ROUND(SUMIF($F$9:$P$9,\"<>\",$F91:$P91),15-13*PO!$X$3))","v":6},6]
[{"$f":"OFFSET(PO!J$12,ROW(A92)-ROW($A$12),0)","v":"Serviço"},{"$f":"IF($A92=0,\"\",OFFSET(PO!K$12,ROW(B92)-ROW(B$12),0))","v":"1.14.11."},{"$f":"IF(OFFSET(PO!N$12,ROW(C92)-ROW(C$12),0)=0,\"\",OFFSET(PO!N$12,ROW(C92)-ROW(C$12),0))","v":"CABIDE/GANCHO DE BANHEIRO SIMPLES EM METAL CROMADO"},{"$f":"IF(OFFSET(PO!O$12,ROW(D92)-ROW(D$12),0)=0,\"\",OFFSET(PO!O$12,ROW(D92)-ROW(D$12),0))","v":"UN"},{"$f":"IF($A92<>\"Serviço\",0,ROUND(SUMIF($F$9:$P$9,\"<>\",$F92:$P92),15-13*PO!$X$3))","v":4},2,2]
[{"$f":"OFFSET(PO!J$12,ROW(A93)-ROW($A$12),0)","v":"Serviço"},{"$f":"IF($A93=0,\"\",OFFSET(PO!K$12,ROW(B93)-ROW(B$12),0))","v":"1.14.12."},{"$f":"IF(OFFSET(PO!N$12,ROW(C93)-ROW(C$12),0)=0,\"\",OFFSET(PO!N$12,ROW(C93)-ROW(C$12),0))","v":"GRANITO PARA BANCADA, POLIDO, TIPO ANDORINHA/ QUARTZ/ CASTELO/ CORUMBA OU OUTROS EQUIVALENTES DA REGIAO, E=  *2,5* CM"},{"$f":"IF(OFFSET(PO!O$12,ROW(D93)-ROW(D$12),0)=0,\"\",OFFSET(PO!O$12,ROW(D93)-ROW(D$12),0))","v":"M2"},{"$f":"IF($A93<>\"Serviço\",0,ROUND(SUMIF($F$9:$P$9,\"<>\",$F93:$P93),15-13*PO!$X$3))","v":0.24},0.12,0.12]
[{"$f":"OFFSET(PO!J$12,ROW(A94)-ROW($A$12),0)","v":"Serviço"},{"$f":"IF($A94=0,\"\",OFFSET(PO!K$12,ROW(B94)-ROW(B$12),0))","v":"1.14.13."},{"$f":"IF(OFFSET(PO!N$12,ROW(C94)-ROW(C$12),0)=0,\"\",OFFSET(PO!N$12,ROW(C94)-ROW(C$12),0))","v":"ESPELHO CRISTAL E = 4 MM"},{"$f":"IF(OFFSET(PO!O$12,ROW(D94)-ROW(D$12),0)=0,\"\",OFFSET(PO!O$12,ROW(D94)-ROW(D$12),0))","v":"M2"},{"$f":"IF($A94<>\"Serviço\",0,ROUND(SUMIF($F$9:$P$9,\"<>\",$F94:$P94),15-13*PO!$X$3))","v":5.4},4.2,1.2]
[{"$f":"OFFSET(PO!J$12,ROW(A95)-ROW($A$12),0)","v":"Serviço"},{"$f":"IF($A95=0,\"\",OFFSET(PO!K$12,ROW(B95)-ROW(B$12),0))","v":"1.14.14."},{"$f":"IF(OFFSET(PO!N$12,ROW(C95)-ROW(C$12),0)=0,\"\",OFFSET(PO!N$12,ROW(C95)-ROW(C$12),0))","v":"TANQUE DE MÁRMORE SINTÉTICO SUSPENSO, 22L OU EQUIVALENTE, INCLUSO SIFÃO TIPO GARRAFA EM PVC, VÁLVULA PLÁSTICA E TORNEIRA DE METAL CROMADO - FORNECIMENTO E INSTALAÇÃO"},{"$f":"IF(OFFSET(PO!O$12,ROW(D95)-ROW(D$12),0)=0,\"\",OFFSET(PO!O$12,ROW(D95)-ROW(D$12),0))","v":"UN"},{"$f":"IF($A95<>\"Serviço\",0,ROUND(SUMIF($F$9:$P$9,\"<>\",$F95:$P95),15-13*PO!$X$3))","v":1},1]
[{"$f":"OFFSET(PO!J$12,ROW(A96)-ROW($A$12),0)","v":"Nível 2"},{"$f":"IF($A96=0,\"\",OFFSET(PO!K$12,ROW(B96)-ROW(B$12),0))","v":"1.15."},{"$f":"IF(OFFSET(PO!N$12,ROW(C96)-ROW(C$12),0)=0,\"\",OFFSET(PO!N$12,ROW(C96)-ROW(C$12),0))","v":"INSTALAÇÕES HIDRAULICAS"},{"$f":"IF(OFFSET(PO!O$12,ROW(D96)-ROW(D$12),0)=0,\"\",OFFSET(PO!O$12,ROW(D96)-ROW(D$12),0))","v":""},{"$f":"IF($A96<>\"Serviço\",0,ROUND(SUMIF($F$9:$P$9,\"<>\",$F96:$P96),15-13*PO!$X$3))","v":0},0]
[{"$f":"OFFSET(PO!J$12,ROW(A97)-ROW($A$12),0)","v":"Serviço"},{"$f":"IF($A97=0,\"\",OFFSET(PO!K$12,ROW(B97)-ROW(B$12),0))","v":"1.15.1."},{"$f":"IF(OFFSET(PO!N$12,ROW(C97)-ROW(C$12),0)=0,\"\",OFFSET(PO!N$12,ROW(C97)-ROW(C$12),0))","v":"HIDRÔMETRO DN 25 (¾ ), 5,0 M³/H FORNECIMENTO E INSTALAÇÃO"},{"$f":"IF(OFFSET(PO!O$12,ROW(D97)-ROW(D$12),0)=0,\"\",OFFSET(PO!O$12,ROW(D97)-ROW(D$12),0))","v":"UN"},{"$f":"IF($A97<>\"Serviço\",0,ROUND(SUMIF($F$9:$P$9,\"<>\",$F97:$P97),15-13*PO!$X$3))","v":1},1]
[{"$f":"OFFSET(PO!J$12,ROW(A98)-ROW($A$12),0)","v":"Serviço"},{"$f":"IF($A98=0,\"\",OFFSET(PO!K$12,ROW(B98)-ROW(B$12),0))","v":"1.15.2."},{"$f":"IF(OFFSET(PO!N$12,ROW(C98)-ROW(C$12),0)=0,\"\",OFFSET(PO!N$12,ROW(C98)-ROW(C$12),0))","v":"KIT CAVALETE PARA MEDIÇÃO DE ÁGUA - ENTRADA PRINCIPAL, EM PVC SOLDÁVEL DN 25 (¾ )   FORNECIMENTO E INSTALAÇÃO "},{"$f":"IF(OFFSET(PO!O$12,ROW(D98)-ROW(D$12),0)=0,\"\",OFFSET(PO!O$12,ROW(D98)-ROW(D$12),0))","v":"UN"},{"$f":"IF($A98<>\"Serviço\",0,ROUND(SUMIF($F$9:$P$9,\"<>\",$F98:$P98),15-13*PO!$X$3))","v":1},1]
[{"$f":"OFFSET(PO!J$12,ROW(A99)-ROW($A$12),0)","v":"Serviço"},{"$f":"IF($A99=0,\"\",OFFSET(PO!K$12,ROW(B99)-ROW(B$12),0))","v":"1.15.3."},{"$f":"IF(OFFSET(PO!N$12,ROW(C99)-ROW(C$12),0)=0,\"\",OFFSET(PO!N$12,ROW(C99)-ROW(C$12),0))","v":"CAIXA EM CONCRETO PRÉ-MOLDADO PARA ABRIGO DE HIDRÔMETRO COM DN 20 (½\u0094) \u0096 FORNECIMENTO E INSTALAÇÃO"},{"$f":"IF(OFFSET(PO!O$12,ROW(D99)-ROW(D$12),0)=0,\"\",OFFSET(PO!O$12,ROW(D99)-ROW(D$12),0))","v":"UN"},{"$f":"IF($A99<>\"Serviço\",0,ROUND(SUMIF($F$9:$P$9,\"<>\",$F99:$P99),15-13*PO!$X$3))","v":1},1]
[{"$f":"OFFSET(PO!J$12,ROW(A100)-ROW($A$12),0)","v":"Serviço"},{"$f":"IF($A100=0,\"\",OFFSET(PO!K$12,ROW(B100)-ROW(B$12),0))","v":"1.15.4."},{"$f":"IF(OFFSET(PO!N$12,ROW(C100)-ROW(C$12),0)=0,\"\",OFFSET(PO!N$12,ROW(C100)-ROW(C$12),0))","v":"TUBOS DE PVC, SOLDÁVEL, ÁGUA FRIA, DN 20 MM, INCLUSIVE CONEXÕES, CORTES E FIXAÇÕES"},{"$f":"IF(OFFSET(PO!O$12,ROW(D100)-ROW(D$12),0)=0,\"\",OFFSET(PO!O$12,ROW(D100)-ROW(D$12),0))","v":"M"},{"$f":"IF($A100<>\"Serviço\",0,ROUND(SUMIF($F$9:$P$9,\"<>\",$F100:$P100),15-13*PO!$X$3))","v":43.6},35,8.6]
[{"$f":"OFFSET(PO!J$12,ROW(A101)-ROW($A$12),0)","v":"Serviço"},{"$f":"IF($A101=0,\"\",OFFSET(PO!K$12,ROW(B101)-ROW(B$12),0))","v":"1.15.5."},{"$f":"IF(OFFSET(PO!N$12,ROW(C101)-ROW(C$12),0)=0,\"\",OFFSET(PO!N$12,ROW(C101)-ROW(C$12),0))","v":"TUBOS DE PVC, SOLDÁVEL, ÁGUA FRIA, DN 25 MM, INCLUSIVE CONEXÕES, CORTES E FIXAÇÕES"},{"$f":"IF(OFFSET(PO!O$12,ROW(D101)-ROW(D$12),0)=0,\"\",OFFSET(PO!O$12,ROW(D101)-ROW(D$12),0))","v":"M"},{"$f":"IF($A101<>\"Serviço\",0,ROUND(SUMIF($F$9:$P$9,\"<>\",$F101:$P101),15-13*PO!$X$3))","v":85.99},19.64,48.3,18.05]
[{"$f":"OFFSET(PO!J$12,ROW(A102)-ROW($A$12),0)","v":"Serviço"},{"$f":"IF($A102=0,\"\",OFFSET(PO!K$12,ROW(B102)-ROW(B$12),0))","v":"1.15.6."},{"$f":"IF(OFFSET(PO!N$12,ROW(C102)-ROW(C$12),0)=0,\"\",OFFSET(PO!N$12,ROW(C102)-ROW(C$12),0))","v":"ESTRUTURA PONTALETADA DE MADEIRA PARA TELHADOS DE TELHA DE CONCRETO, INCLUSO TRANSPORTE VERTICAL"},{"$f":"IF(OFFSET(PO!O$12,ROW(D102)-ROW(D$12),0)=0,\"\",OFFSET(PO!O$12,ROW(D102)-ROW(D$12),0))","v":"M2"},{"$f":"IF($A102<>\"Serviço\",0,ROUND(SUMIF($F$9:$P$9,\"<>\",$F102:$P102),15-13*PO!$X$3))","v":1},1]
[{"$f":"OFFSET(PO!J$12,ROW(A103)-ROW($A$12),0)","v":"Serviço"},{"$f":"IF($A103=0,\"\",OFFSET(PO!K$12,ROW(B103)-ROW(B$12),0))","v":"1.15.7."},{"$f":"IF(OFFSET(PO!N$12,ROW(C103)-ROW(C$12),0)=0,\"\",OFFSET(PO!N$12,ROW(C103)-ROW(C$12),0))","v":"CAIXA D'AGUA FIBRA DE VIDRO PARA 2000 LITROS, COM TAMPA"},{"$f":"IF(OFFSET(PO!O$12,ROW(D103)-ROW(D$12),0)=0,\"\",OFFSET(PO!O$12,ROW(D103)-ROW(D$12),0))","v":"UN"},{"$f":"IF($A103<>\"Serviço\",0,ROUND(SUMIF($F$9:$P$9,\"<>\",$F103:$P103),15-13*PO!$X$3))","v":1},1]
[{"$f":"OFFSET(PO!J$12,ROW(A104)-ROW($A$12),0)","v":"Serviço"},{"$f":"IF($A104=0,\"\",OFFSET(PO!K$12,ROW(B104)-ROW(B$12),0))","v":"1.15.8."},{"$f":"IF(OFFSET(PO!N$12,ROW(C104)-ROW(C$12),0)=0,\"\",OFFSET(PO!N$12,ROW(C104)-ROW(C$12),0))","v":"REGISTRO GAVETA COM ACABAMENTO E CANOPLA CROMADOS, SIMPLES, BITOLA 1 \" (REF 1509)"},{"$f":"IF(OFFSET(PO!O$12,ROW(D104)-ROW(D$12),0)=0,\"\",OFFSET(PO!O$12,ROW(D104)-ROW(D$12),0))","v":"UN"},{"$f":"IF($A104<>\"Serviço\",0,ROUND(SUMIF($F$9:$P$9,\"<>\",$F104:$P104),15-13*PO!$X$3))","v":5},3,2]
[{"$f":"OFFSET(PO!J$12,ROW(A105)-ROW($A$12),0)","v":"Serviço"},{"$f":"IF($A105=0,\"\",OFFSET(PO!K$12,ROW(B105)-ROW(B$12),0))","v":"1.15.9."},{"$f":"IF(OFFSET(PO!N$12,ROW(C105)-ROW(C$12),0)=0,\"\",OFFSET(PO!N$12,ROW(C105)-ROW(C$12),0))","v":"REGISTRO DE ESFERA, PVC, ROSCÁVEL, 3/4\", FORNECIDO E INSTALADO EM RAMAL DE ÁGUA"},{"$f":"IF(OFFSET(PO!O$12,ROW(D105)-ROW(D$12),0)=0,\"\",OFFSET(PO!O$12,ROW(D105)-ROW(D$12),0))","v":"UN"},{"$f":"IF($A105<>\"Serviço\",0,ROUND(SUMIF($F$9:$P$9,\"<>\",$F105:$P105),15-13*PO!$X$3))","v":4},3,null,1]
[{"$f":"OFFSET(PO!J$12,ROW(A106)-ROW($A$12),0)","v":"Nível 2"},{"$f":"IF($A106=0,\"\",OFFSET(PO!K$12,ROW(B106)-ROW(B$12),0))","v":"1.16."},{"$f":"IF(OFFSET(PO!N$12,ROW(C106)-ROW(C$12),0)=0,\"\",OFFSET(PO!N$12,ROW(C106)-ROW(C$12),0))","v":"INSTALAÇÕES SANITÁRIAS E PLUVIAIS"},{"$f":"IF(OFFSET(PO!O$12,ROW(D106)-ROW(D$12),0)=0,\"\",OFFSET(PO!O$12,ROW(D106)-ROW(D$12),0))","v":""},{"$f":"IF($A106<>\"Serviço\",0,ROUND(SUMIF($F$9:$P$9,\"<>\",$F106:$P106),15-13*PO!$X$3))","v":0},0]
[{"$f":"OFFSET(PO!J$12,ROW(A107)-ROW($A$12),0)","v":"Serviço"},{"$f":"IF($A107=0,\"\",OFFSET(PO!K$12,ROW(B107)-ROW(B$12),0))","v":"1.16.1."},{"$f":"IF(OFFSET(PO!N$12,ROW(C107)-ROW(C$12),0)=0,\"\",OFFSET(PO!N$12,ROW(C107)-ROW(C$12),0))","v":"INSTALAÇÃO DE TUBO DE PVC, SÉRIE NORMAL, ESGOTO PREDIAL, DN 40 MM, INCLUSIVE CONEXÕES, CORTES E FIXAÇÕES"},{"$f":"IF(OFFSET(PO!O$12,ROW(D107)-ROW(D$12),0)=0,\"\",OFFSET(PO!O$12,ROW(D107)-ROW(D$12),0))","v":"M"},{"$f":"IF($A107<>\"Serviço\",0,ROUND(SUMIF($F$9:$P$9,\"<>\",$F107:$P107),15-13*PO!$X$3))","v":14.7},6.5,8.1999999999999993]
[{"$f":"OFFSET(PO!J$12,ROW(A108)-ROW($A$12),0)","v":"Serviço"},{"$f":"IF($A108=0,\"\",OFFSET(PO!K$12,ROW(B108)-ROW(B$12),0))","v":"1.16.2."},{"$f":"IF(OFFSET(PO!N$12,ROW(C108)-ROW(C$12),0)=0,\"\",OFFSET(PO!N$12,ROW(C108)-ROW(C$12),0))","v":"TUBO DE PVC, SÉRIE NORMAL, ESGOTO PREDIAL, DN 50 MM, INCLUSIVE CONEXÕES, CORTES E FIXAÇÕES"},{"$f":"IF(OFFSET(PO!O$12,ROW(D108)-ROW(D$12),0)=0,\"\",OFFSET(PO!O$12,ROW(D108)-ROW(D$12),0))","v":"M"},{"$f":"IF($A108<>\"Serviço\",0,ROUND(SUMIF($F$9:$P$9,\"<>\",$F108:$P108),15-13*PO!$X$3))","v":51.7},22.7,29]
[{"$f":"OFFSET(PO!J$12,ROW(A109)-ROW($A$12),0)","v":"Serviço"},{"$f":"IF($A109=0,\"\",OFFSET(PO!K$12,ROW(B109)-ROW(B$12),0))","v":"1.16.3."},{"$f":"IF(OFFSET(PO!N$12,ROW(C109)-ROW(C$12),0)=0,\"\",OFFSET(PO!N$12,ROW(C109)-ROW(C$12),0))","v":"INST. TUBO PVC, SÉRIE N, ESGOTO PREDIAL, DN 75 MM, INCL. CONEXÕES, CORTES E FIXAÇÕES"},{"$f":"IF(OFFSET(PO!O$12,ROW(D109)-ROW(D$12),0)=0,\"\",OFFSET(PO!O$12,ROW(D109)-ROW(D$12),0))","v":"M"},{"$f":"IF($A109<>\"Serviço\",0,ROUND(SUMIF($F$9:$P$9,\"<>\",$F109:$P109),15-13*PO!$X$3))","v":8.3000000000000007},8.3000000000000007]
[{"$f":"OFFSET(PO!J$12,ROW(A110)-ROW($A$12),0)","v":"Serviço"},{"$f":"IF($A110=0,\"\",OFFSET(PO!K$12,ROW(B110)-ROW(B$12),0))","v":"1.16.4."},{"$f":"IF(OFFSET(PO!N$12,ROW(C110)-ROW(C$12),0)=0,\"\",OFFSET(PO!N$12,ROW(C110)-ROW(C$12),0))","v":"SERVIÇO DE INST. TUBO PVC, SÉRIE N, ESGOTO PREDIAL, 100 MM, INCL. CONEXÕES E CORTES, FIXAÇÕES"},{"$f":"IF(OFFSET(PO!O$12,ROW(D110)-ROW(D$12),0)=0,\"\",OFFSET(PO!O$12,ROW(D110)-ROW(D$12),0))","v":"M"},{"$f":"IF($A110<>\"Serviço\",0,ROUND(SUMIF($F$9:$P$9,\"<>\",$F110:$P110),15-13*PO!$X$3))","v":43.8},34.799999999999997,9]
[{"$f":"OFFSET(PO!J$12,ROW(A111)-ROW($A$12),0)","v":"Serviço"},{"$f":"IF($A111=0,\"\",OFFSET(PO!K$12,ROW(B111)-ROW(B$12),0))","v":"1.16.5."},{"$f":"IF(OFFSET(PO!N$12,ROW(C111)-ROW(C$12),0)=0,\"\",OFFSET(PO!N$12,ROW(C111)-ROW(C$12),0))","v":"TUBO DE PVC, SÉRIE NORMAL, ESGOTO PREDIAL, DN 150 MM, INCLUSIVE CONEXÕES, CORTES E FIXAÇÕES"},{"$f":"IF(OFFSET(PO!O$12,ROW(D111)-ROW(D$12),0)=0,\"\",OFFSET(PO!O$12,ROW(D111)-ROW(D$12),0))","v":"M"},{"$f":"IF($A111<>\"Serviço\",0,ROUND(SUMIF($F$9:$P$9,\"<>\",$F111:$P111),15-13*PO!$X$3))","v":184.83},90.23,94.6]
[{"$f":"OFFSET(PO!J$12,ROW(A112)-ROW($A$12),0)","v":"Serviço"},{"$f":"IF($A112=0,\"\",OFFSET(PO!K$12,ROW(B112)-ROW(B$12),0))","v":"1.16.6."},{"$f":"IF(OFFSET(PO!N$12,ROW(C112)-ROW(C$12),0)=0,\"\",OFFSET(PO!N$12,ROW(C112)-ROW(C$12),0))","v":"TANQUE SÉPTICO 2,60 x 1,50m x 1,80m (CxLxA)"},{"$f":"IF(OFFSET(PO!O$12,ROW(D112)-ROW(D$12),0)=0,\"\",OFFSET(PO!O$12,ROW(D112)-ROW(D$12),0))","v":"Unid"},{"$f":"IF($A112<>\"Serviço\",0,ROUND(SUMIF($F$9:$P$9,\"<>\",$F112:$P112),15-13*PO!$X$3))","v":1},1]
[{"$f":"OFFSET(PO!J$12,ROW(A113)-ROW($A$12),0)","v":"Serviço"},{"$f":"IF($A113=0,\"\",OFFSET(PO!K$12,ROW(B113)-ROW(B$12),0))","v":"1.16.7."},{"$f":"IF(OFFSET(PO!N$12,ROW(C113)-ROW(C$12),0)=0,\"\",OFFSET(PO!N$12,ROW(C113)-ROW(C$12),0))","v":"SUMIDOURO 4,8 x 2,50m x 1,70m (CxLxA)"},{"$f":"IF(OFFSET(PO!O$12,ROW(D113)-ROW(D$12),0)=0,\"\",OFFSET(PO!O$12,ROW(D113)-ROW(D$12),0))","v":"Unid"},{"$f":"IF($A113<>\"Serviço\",0,ROUND(SUMIF($F$9:$P$9,\"<>\",$F113:$P113),15-13*PO!$X$3))","v":1},1]
[{"$f":"OFFSET(PO!J$12,ROW(A114)-ROW($A$12),0)","v":"Serviço"},{"$f":"IF($A114=0,\"\",OFFSET(PO!K$12,ROW(B114)-ROW(B$12),0))","v":"1.16.8."},{"$f":"IF(OFFSET(PO!N$12,ROW(C114)-ROW(C$12),0)=0,\"\",OFFSET(PO!N$12,ROW(C114)-ROW(C$12),0))","v":"CAIXA DE GORDURA DUPLA EM CONCRETO PRE-MOLDADO DN 60,0 CM COM TAMPA "},{"$f":"IF(OFFSET(PO!O$12,ROW(D114)-ROW(D$12),0)=0,\"\",OFFSET(PO!O$12,ROW(D114)-ROW(D$12),0))","v":"UN"},{"$f":"IF($A114<>\"Serviço\",0,ROUND(SUMIF($F$9:$P$9,\"<>\",$F114:$P114),15-13*PO!$X$3))","v":2},2]
[{"$f":"OFFSET(PO!J$12,ROW(A115)-ROW($A$12),0)","v":"Serviço"},{"$f":"IF($A115=0,\"\",OFFSET(PO!K$12,ROW(B115)-ROW(B$12),0))","v":"1.16.9."},{"$f":"IF(OFFSET(PO!N$12,ROW(C115)-ROW(C$12),0)=0,\"\",OFFSET(PO!N$12,ROW(C115)-ROW(C$12),0))","v":"CAIXA DE PASSAGEM EM CONCRETO DN 60CM X 60CM DE ALTURA COM TAMPA, COM TAMPA"},{"$f":"IF(OFFSET(PO!O$12,ROW(D115)-ROW(D$12),0)=0,\"\",OFFSET(PO!O$12,ROW(D115)-ROW(D$12),0))","v":"UN"},{"$f":"IF($A115<>\"Serviço\",0,ROUND(SUMIF($F$9:$P$9,\"<>\",$F115:$P115),15-13*PO!$X$3))","v":14},14]
[{"$f":"OFFSET(PO!J$12,ROW(A116)-ROW($A$12),0)","v":"Serviço"},{"$f":"IF($A116=0,\"\",OFFSET(PO!K$12,ROW(B116)-ROW(B$12),0))","v":"1.16.10."},{"$f":"IF(OFFSET(PO!N$12,ROW(C116)-ROW(C$12),0)=0,\"\",OFFSET(PO!N$12,ROW(C116)-ROW(C$12),0))","v":"CAIXA DE INSPEÇÃO EM CONCRETO DN 60CM X 60CM DE ALTURA COM TAMPA, COM TAMPA"},{"$f":"IF(OFFSET(PO!O$12,ROW(D116)-ROW(D$12),0)=0,\"\",OFFSET(PO!O$12,ROW(D116)-ROW(D$12),0))","v":"UN"},{"$f":"IF($A116<>\"Serviço\",0,ROUND(SUMIF($F$9:$P$9,\"<>\",$F116:$P116),15-13*PO!$X$3))","v":4},4]
[{"$f":"OFFSET(PO!J$12,ROW(A117)-ROW($A$12),0)","v":"Serviço"},{"$f":"IF($A117=0,\"\",OFFSET(PO!K$12,ROW(B117)-ROW(B$12),0))","v":"1.16.11."},{"$f":"IF(OFFSET(PO!N$12,ROW(C117)-ROW(C$12),0)=0,\"\",OFFSET(PO!N$12,ROW(C117)-ROW(C$12),0))","v":"RALO SIFONADO PVC, QUADRADO, 100 X 100 X 53 MM, SAIDA 40 MM, COM GRELHA BRANCA"},{"$f":"IF(OFFSET(PO!O$12,ROW(D117)-ROW(D$12),0)=0,\"\",OFFSET(PO!O$12,ROW(D117)-ROW(D$12),0))","v":"UN"},{"$f":"IF($A117<>\"Serviço\",0,ROUND(SUMIF($F$9:$P$9,\"<>\",$F117:$P117),15-13*PO!$X$3))","v":6},4,2]
[{"$f":"OFFSET(PO!J$12,ROW(A118)-ROW($A$12),0)","v":"Serviço"},{"$f":"IF($A118=0,\"\",OFFSET(PO!K$12,ROW(B118)-ROW(B$12),0))","v":"1.16.12."},{"$f":"IF(OFFSET(PO!N$12,ROW(C118)-ROW(C$12),0)=0,\"\",OFFSET(PO!N$12,ROW(C118)-ROW(C$12),0))","v":"CISTERNA COM RESERVATÓRIO DE 2.000L, ENTERRADA PARA COLETAS DE AGUAS DA CHUVA E REUTILIZAÇÃO, COM BOMBA CENTRÍFUGA"},{"$f":"IF(OFFSET(PO!O$12,ROW(D118)-ROW(D$12),0)=0,\"\",OFFSET(PO!O$12,ROW(D118)-ROW(D$12),0))","v":"Unid"},{"$f":"IF($A118<>\"Serviço\",0,ROUND(SUMIF($F$9:$P$9,\"<>\",$F118:$P118),15-13*PO!$X$3))","v":1},1]
[{"$f":"OFFSET(PO!J$12,ROW(A119)-ROW($A$12),0)","v":"Nível 2"},{"$f":"IF($A119=0,\"\",OFFSET(PO!K$12,ROW(B119)-ROW(B$12),0))","v":"1.17."},{"$f":"IF(OFFSET(PO!N$12,ROW(C119)-ROW(C$12),0)=0,\"\",OFFSET(PO!N$12,ROW(C119)-ROW(C$12),0))","v":"INSTALAÇÕES ELÉTRICAS"},{"$f":"IF(OFFSET(PO!O$12,ROW(D119)-ROW(D$12),0)=0,\"\",OFFSET(PO!O$12,ROW(D119)-ROW(D$12),0))","v":""},{"$f":"IF($A119<>\"Serviço\",0,ROUND(SUMIF($F$9:$P$9,\"<>\",$F119:$P119),15-13*PO!$X$3))","v":0},0]
[{"$f":"OFFSET(PO!J$12,ROW(A120)-ROW($A$12),0)","v":"Serviço"},{"$f":"IF($A120=0,\"\",OFFSET(PO!K$12,ROW(B120)-ROW(B$12),0))","v":"1.17.1."},{"$f":"IF(OFFSET(PO!N$12,ROW(C120)-ROW(C$12),0)=0,\"\",OFFSET(PO!N$12,ROW(C120)-ROW(C$12),0))","v":"ENTRADA PROVISORIA DE ENERGIA ELETRICA AEREA TRIFASICA 40A EM POSTE MADEIRA"},{"$f":"IF(OFFSET(PO!O$12,ROW(D120)-ROW(D$12),0)=0,\"\",OFFSET(PO!O$12,ROW(D120)-ROW(D$12),0))","v":"UN"},{"$f":"IF($A120<>\"Serviço\",0,ROUND(SUMIF($F$9:$P$9,\"<>\",$F120:$P120),15-13*PO!$X$3))","v":1},1]
[{"$f":"OFFSET(PO!J$12,ROW(A121)-ROW($A$12),0)","v":"Serviço"},{"$f":"IF($A121=0,\"\",OFFSET(PO!K$12,ROW(B121)-ROW(B$12),0))","v":"1.17.2."},{"$f":"IF(OFFSET(PO!N$12,ROW(C121)-ROW(C$12),0)=0,\"\",OFFSET(PO!N$12,ROW(C121)-ROW(C$12),0))","v":"ENTRADA DE ENERGIA ELÉTRICA AÉREA MONOFÁSICA 50A COM POSTE DE CONCRETO, INCLUSIVE CABEAMENTO, CAIXA DE PROTEÇÃO PARA MEDIDOR E ATERRAMENTO."},{"$f":"IF(OFFSET(PO!O$12,ROW(D121)-ROW(D$12),0)=0,\"\",OFFSET(PO!O$12,ROW(D121)-ROW(D$12),0))","v":"UN"},{"$f":"IF($A121<>\"Serviço\",0,ROUND(SUMIF($F$9:$P$9,\"<>\",$F121:$P121),15-13*PO!$X$3))","v":1},1]
[{"$f":"OFFSET(PO!J$12,ROW(A122)-ROW($A$12),0)","v":"Serviço"},{"$f":"IF($A122=0,\"\",OFFSET(PO!K$12,ROW(B122)-ROW(B$12),0))","v":"1.17.3."},{"$f":"IF(OFFSET(PO!N$12,ROW(C122)-ROW(C$12),0)=0,\"\",OFFSET(PO!N$12,ROW(C122)-ROW(C$12),0))","v":"QUADRO DE DISTRIBUICAO DE ENERGIA DE EMBUTIR, EM CHAPA METALICA, PARA 24 DISJUNTORES TERMOMAGNETICOS MONOPOLARES, COM BARRAMENTO TRIFASICO E NEUTRO, FORNECIMENTO E INSTALACAO"},{"$f":"IF(OFFSET(PO!O$12,ROW(D122)-ROW(D$12),0)=0,\"\",OFFSET(PO!O$12,ROW(D122)-ROW(D$12),0))","v":"UN"},{"$f":"IF($A122<>\"Serviço\",0,ROUND(SUMIF($F$9:$P$9,\"<>\",$F122:$P122),15-13*PO!$X$3))","v":1},1]
[{"$f":"OFFSET(PO!J$12,ROW(A123)-ROW($A$12),0)","v":"Serviço"},{"$f":"IF($A123=0,\"\",OFFSET(PO!K$12,ROW(B123)-ROW(B$12),0))","v":"1.17.4."},{"$f":"IF(OFFSET(PO!N$12,ROW(C123)-ROW(C$12),0)=0,\"\",OFFSET(PO!N$12,ROW(C123)-ROW(C$12),0))","v":"DISJUNTOR TERMOMAGNETICO TRIPOLAR PADRAO NEMA (AMERICANO) 60 A 100A 240V, FORNECIMENTO E INSTALACAO"},{"$f":"IF(OFFSET(PO!O$12,ROW(D123)-ROW(D$12),0)=0,\"\",OFFSET(PO!O$12,ROW(D123)-ROW(D$12),0))","v":"UN"},{"$f":"IF($A123<>\"Serviço\",0,ROUND(SUMIF($F$9:$P$9,\"<>\",$F123:$P123),15-13*PO!$X$3))","v":1},1]
[{"$f":"OFFSET(PO!J$12,ROW(A124)-ROW($A$12),0)","v":"Serviço"},{"$f":"IF($A124=0,\"\",OFFSET(PO!K$12,ROW(B124)-ROW(B$12),0))","v":"1.17.5."},{"$f":"IF(OFFSET(PO!N$12,ROW(C124)-ROW(C$12),0)=0,\"\",OFFSET(PO!N$12,ROW(C124)-ROW(C$12),0))","v":"DISJUNTOR MONOPOLAR TIPO DIN, CORRENTE NOMINAL DE 10A - FORNECIMENTO E INSTALAÇÃ"},{"$f":"IF(OFFSET(PO!O$12,ROW(D124)-ROW(D$12),0)=0,\"\",OFFSET(PO!O$12,ROW(D124)-ROW(D$12),0))","v":"UN"},{"$f":"IF($A124<>\"Serviço\",0,ROUND(SUMIF($F$9:$P$9,\"<>\",$F124:$P124),15-13*PO!$X$3))","v":21},9,12]
[{"$f":"OFFSET(PO!J$12,ROW(A125)-ROW($A$12),0)","v":"Serviço"},{"$f":"IF($A125=0,\"\",OFFSET(PO!K$12,ROW(B125)-ROW(B$12),0))","v":"1.17.6."},{"$f":"IF(OFFSET(PO!N$12,ROW(C125)-ROW(C$12),0)=0,\"\",OFFSET(PO!N$12,ROW(C125)-ROW(C$12),0))","v":"DISJUNTOR MONOPOLAR TIPO DIN, CORRENTE NOMINAL DE 16A - FORNECIMENTO E INSTALAÇÃO"},{"$f":"IF(OFFSET(PO!O$12,ROW(D125)-ROW(D$12),0)=0,\"\",OFFSET(PO!O$12,ROW(D125)-ROW(D$12),0))","v":"UN"},{"$f":"IF($A125<>\"Serviço\",0,ROUND(SUMIF($F$9:$P$9,\"<>\",$F125:$P125),15-13*PO!$X$3))","v":7},2,5]
[{"$f":"OFFSET(PO!J$12,ROW(A126)-ROW($A$12),0)","v":"Serviço"},{"$f":"IF($A126=0,\"\",OFFSET(PO!K$12,ROW(B126)-ROW(B$12),0))","v":"1.17.7."},{"$f":"IF(OFFSET(PO!N$12,ROW(C126)-ROW(C$12),0)=0,\"\",OFFSET(PO!N$12,ROW(C126)-ROW(C$12),0))","v":"DISJUNTOR MONOPOLAR TIPO DIN, CORRENTE NOMINAL DE 50A - FORNECIMENTO E INSTALAÇÃO"},{"$f":"IF(OFFSET(PO!O$12,ROW(D126)-ROW(D$12),0)=0,\"\",OFFSET(PO!O$12,ROW(D126)-ROW(D$12),0))","v":"UN"},{"$f":"IF($A126<>\"Serviço\",0,ROUND(SUMIF($F$9:$P$9,\"<>\",$F126:$P126),15-13*PO!$X$3))","v":2},1,1]
[{"$f":"OFFSET(PO!J$12,ROW(A127)-ROW($A$12),0)","v":"Serviço"},{"$f":"IF($A127=0,\"\",OFFSET(PO!K$12,ROW(B127)-ROW(B$12),0))","v":"1.17.8."},{"$f":"IF(OFFSET(PO!N$12,ROW(C127)-ROW(C$12),0)=0,\"\",OFFSET(PO!N$12,ROW(C127)-ROW(C$12),0))","v":"PONTO DE ILUMINAÇÃO RESIDENCIAL INCLUINDO INTERRUPTOR SIMPLES, CAIXA ELÉTRICA, ELETRODUTO, CABO, RASGO, QUEBRA E CHUMBAMENTO"},{"$f":"IF(OFFSET(PO!O$12,ROW(D127)-ROW(D$12),0)=0,\"\",OFFSET(PO!O$12,ROW(D127)-ROW(D$12),0))","v":"UN"},{"$f":"IF($A127<>\"Serviço\",0,ROUND(SUMIF($F$9:$P$9,\"<>\",$F127:$P127),15-13*PO!$X$3))","v":6},3,3]
[{"$f":"OFFSET(PO!J$12,ROW(A128)-ROW($A$12),0)","v":"Serviço"},{"$f":"IF($A128=0,\"\",OFFSET(PO!K$12,ROW(B128)-ROW(B$12),0))","v":"1.17.9."},{"$f":"IF(OFFSET(PO!N$12,ROW(C128)-ROW(C$12),0)=0,\"\",OFFSET(PO!N$12,ROW(C128)-ROW(C$12),0))","v":"PONTO DE ILUMINAÇÃO RESIDENCIAL INCLUINDO INTERRUPTOR SIMPLES (2 MÓDULOS), CAIXA ELÉTRICA, ELETRODUTO, CABO, RASGO, QUEBRA E CHUMBAMENTO "},{"$f":"IF(OFFSET(PO!O$12,ROW(D128)-ROW(D$12),0)=0,\"\",OFFSET(PO!O$12,ROW(D128)-ROW(D$12),0))","v":"UN"},{"$f":"IF($A128<>\"Serviço\",0,ROUND(SUMIF($F$9:$P$9,\"<>\",$F128:$P128),15-13*PO!$X$3))","v":9},3,6]
[{"$f":"OFFSET(PO!J$12,ROW(A129)-ROW($A$12),0)","v":"Serviço"},{"$f":"IF($A129=0,\"\",OFFSET(PO!K$12,ROW(B129)-ROW(B$12),0))","v":"1.17.10."},{"$f":"IF(OFFSET(PO!N$12,ROW(C129)-ROW(C$12),0)=0,\"\",OFFSET(PO!N$12,ROW(C129)-ROW(C$12),0))","v":"PONTO DE ILUMINAÇÃO RESIDENCIAL INCLUINDO INTERRUPTOR PARALELO, CAIXA ELÉTRICA, ELETRODUTO, CABO, RASGO, QUEBRA E CHUMBAMENTO "},{"$f":"IF(OFFSET(PO!O$12,ROW(D129)-ROW(D$12),0)=0,\"\",OFFSET(PO!O$12,ROW(D129)-ROW(D$12),0))","v":"UN"},{"$f":"IF($A129<>\"Serviço\",0,ROUND(SUMIF($F$9:$P$9,\"<>\",$F129:$P129),15-13*PO!$X$3))","v":8},6,2]
[{"$f":"OFFSET(PO!J$12,ROW(A130)-ROW($A$12),0)","v":"Serviço"},{"$f":"IF($A130=0,\"\",OFFSET(PO!K$12,ROW(B130)-ROW(B$12),0))","v":"1.17.11."},{"$f":"IF(OFFSET(PO!N$12,ROW(C130)-ROW(C$12),0)=0,\"\",OFFSET(PO!N$12,ROW(C130)-ROW(C$12),0))","v":"PONTO DE ILUMINAÇÃO RESIDENCIAL INCLUINDO INTERRUPTOR PARALELO (2 MÓDULOS), CAIXA ELÉTRICA, ELETRODUTO, CABO, RASGO, QUEBRA E CHUMBAMENTO "},{"$f":"IF(OFFSET(PO!O$12,ROW(D130)-ROW(D$12),0)=0,\"\",OFFSET(PO!O$12,ROW(D130)-ROW(D$12),0))","v":"UN"},{"$f":"IF($A130<>\"Serviço\",0,ROUND(SUMIF($F$9:$P$9,\"<>\",$F130:$P130),15-13*PO!$X$3))","v":4},3,1]
[{"$f":"OFFSET(PO!J$12,ROW(A131)-ROW($A$12),0)","v":"Serviço"},{"$f":"IF($A131=0,\"\",OFFSET(PO!K$12,ROW(B131)-ROW(B$12),0))","v":"1.17.12."},{"$f":"IF(OFFSET(PO!N$12,ROW(C131)-ROW(C$12),0)=0,\"\",OFFSET(PO!N$12,ROW(C131)-ROW(C$12),0))","v":"PONTO DE TOMADA RESIDENCIAL INCLUINDO TOMADA 10A/250V, CAIXA ELÉTRICA, ELETRODUTO, CABO, RASGO, QUEBRA E CHUMBAMENTO"},{"$f":"IF(OFFSET(PO!O$12,ROW(D131)-ROW(D$12),0)=0,\"\",OFFSET(PO!O$12,ROW(D131)-ROW(D$12),0))","v":"UN"},{"$f":"IF($A131<>\"Serviço\",0,ROUND(SUMIF($F$9:$P$9,\"<>\",$F131:$P131),15-13*PO!$X$3))","v":106},58,48]
[{"$f":"OFFSET(PO!J$12,ROW(A132)-ROW($A$12),0)","v":"Serviço"},{"$f":"IF($A132=0,\"\",OFFSET(PO!K$12,ROW(B132)-ROW(B$12),0))","v":"1.17.13."},{"$f":"IF(OFFSET(PO!N$12,ROW(C132)-ROW(C$12),0)=0,\"\",OFFSET(PO!N$12,ROW(C132)-ROW(C$12),0))","v":"PONTO DE TOMADA RESIDENCIAL INCLUINDO TOMADA 20A/250V, CAIXA ELÉTRICA, ELETRODUTO, CABO, RASGO, QUEBRA E CHUMBAMENTO"},{"$f":"IF(OFFSET(PO!O$12,ROW(D132)-ROW(D$12),0)=0,\"\",OFFSET(PO!O$12,ROW(D132)-ROW(D$12),0))","v":"UN"},{"$f":"IF($A132<>\"Serviço\",0,ROUND(SUMIF($F$9:$P$9,\"<>\",$F132:$P132),15-13*PO!$X$3))","v":10},2,8]
[{"$f":"OFFSET(PO!J$12,ROW(A133)-ROW($A$12),0)","v":"Serviço"},{"$f":"IF($A133=0,\"\",OFFSET(PO!K$12,ROW(B133)-ROW(B$12),0))","v":"1.17.14."},{"$f":"IF(OFFSET(PO!N$12,ROW(C133)-ROW(C$12),0)=0,\"\",OFFSET(PO!N$12,ROW(C133)-ROW(C$12),0))","v":"LUMINARIA LED PLAFON REDONDO DE SOBREPOR BIVOLT 12/13 W,  D = *17* CM"},{"$f":"IF(OFFSET(PO!O$12,ROW(D133)-ROW(D$12),0)=0,\"\",OFFSET(PO!O$12,ROW(D133)-ROW(D$12),0))","v":"UN"},{"$f":"IF($A133<>\"Serviço\",0,ROUND(SUMIF($F$9:$P$9,\"<>\",$F133:$P133),15-13*PO!$X$3))","v":13},2,11]
[{"$f":"OFFSET(PO!J$12,ROW(A134)-ROW($A$12),0)","v":"Serviço"},{"$f":"IF($A134=0,\"\",OFFSET(PO!K$12,ROW(B134)-ROW(B$12),0))","v":"1.17.15."},{"$f":"IF(OFFSET(PO!N$12,ROW(C134)-ROW(C$12),0)=0,\"\",OFFSET(PO!N$12,ROW(C134)-ROW(C$12),0))","v":"LÂMPADA COMPACTA DE LED 10 W, BASE E27 - FORNECIMENTO E INSTALAÇÃO"},{"$f":"IF(OFFSET(PO!O$12,ROW(D134)-ROW(D$12),0)=0,\"\",OFFSET(PO!O$12,ROW(D134)-ROW(D$12),0))","v":"UN"},{"$f":"IF($A134<>\"Serviço\",0,ROUND(SUMIF($F$9:$P$9,\"<>\",$F134:$P134),15-13*PO!$X$3))","v":13},2,11]
[{"$f":"OFFSET(PO!J$12,ROW(A135)-ROW($A$12),0)","v":"Serviço"},{"$f":"IF($A135=0,\"\",OFFSET(PO!K$12,ROW(B135)-ROW(B$12),0))","v":"1.17.16."},{"$f":"IF(OFFSET(PO!N$12,ROW(C135)-ROW(C$12),0)=0,\"\",OFFSET(PO!N$12,ROW(C135)-ROW(C$12),0))","v":"LUMINÁRIA TIPO PLAFON, DE SOBREPOR, COM 1 LÂMPADA LED - FORNECIMENTO E INSTALAÇÃO"},{"$f":"IF(OFFSET(PO!O$12,ROW(D135)-ROW(D$12),0)=0,\"\",OFFSET(PO!O$12,ROW(D135)-ROW(D$12),0))","v":"UN"},{"$f":"IF($A135<>\"Serviço\",0,ROUND(SUMIF($F$9:$P$9,\"<>\",$F135:$P135),15-13*PO!$X$3))","v":53},29,24]
[{"$f":"OFFSET(PO!J$12,ROW(A136)-ROW($A$12),0)","v":"Serviço"},{"$f":"IF($A136=0,\"\",OFFSET(PO!K$12,ROW(B136)-ROW(B$12),0))","v":"1.17.17."},{"$f":"IF(OFFSET(PO!N$12,ROW(C136)-ROW(C$12),0)=0,\"\",OFFSET(PO!N$12,ROW(C136)-ROW(C$12),0))","v":"ELETRODUTO FLEXIVEL, EM ACO, TIPO CONDUITE, DIAMETRO DE 3\""},{"$f":"IF(OFFSET(PO!O$12,ROW(D136)-ROW(D$12),0)=0,\"\",OFFSET(PO!O$12,ROW(D136)-ROW(D$12),0))","v":"M"},{"$f":"IF($A136<>\"Serviço\",0,ROUND(SUMIF($F$9:$P$9,\"<>\",$F136:$P136),15-13*PO!$X$3))","v":21.6},18.100000000000001,3.5]
[{"$f":"OFFSET(PO!J$12,ROW(A137)-ROW($A$12),0)","v":"Serviço"},{"$f":"IF($A137=0,\"\",OFFSET(PO!K$12,ROW(B137)-ROW(B$12),0))","v":"1.17.18."},{"$f":"IF(OFFSET(PO!N$12,ROW(C137)-ROW(C$12),0)=0,\"\",OFFSET(PO!N$12,ROW(C137)-ROW(C$12),0))","v":"HASTE DE ATERRAMENTO EM ACO COM 3,00 M DE COMPRIMENTO E DN = 5/8\", REVESTIDA COM BAIXA CAMADA DE COBRE, COM CONECTOR TIPO GRAMPO"},{"$f":"IF(OFFSET(PO!O$12,ROW(D137)-ROW(D$12),0)=0,\"\",OFFSET(PO!O$12,ROW(D137)-ROW(D$12),0))","v":"UN"},{"$f":"IF($A137<>\"Serviço\",0,ROUND(SUMIF($F$9:$P$9,\"<>\",$F137:$P137),15-13*PO!$X$3))","v":3},3]
[{"$f":"OFFSET(PO!J$12,ROW(A138)-ROW($A$12),0)","v":"Nível 2"},{"$f":"IF($A138=0,\"\",OFFSET(PO!K$12,ROW(B138)-ROW(B$12),0))","v":"1.18."},{"$f":"IF(OFFSET(PO!N$12,ROW(C138)-ROW(C$12),0)=0,\"\",OFFSET(PO!N$12,ROW(C138)-ROW(C$12),0))","v":"ENTORNO E APARELHOS"},{"$f":"IF(OFFSET(PO!O$12,ROW(D138)-ROW(D$12),0)=0,\"\",OFFSET(PO!O$12,ROW(D138)-ROW(D$12),0))","v":""},{"$f":"IF($A138<>\"Serviço\",0,ROUND(SUMIF($F$9:$P$9,\"<>\",$F138:$P138),15-13*PO!$X$3))","v":0},0]
[{"$f":"OFFSET(PO!J$12,ROW(A139)-ROW($A$12),0)","v":"Serviço"},{"$f":"IF($A139=0,\"\",OFFSET(PO!K$12,ROW(B139)-ROW(B$12),0))","v":"1.18.1."},{"$f":"IF(OFFSET(PO!N$12,ROW(C139)-ROW(C$12),0)=0,\"\",OFFSET(PO!N$12,ROW(C139)-ROW(C$12),0))","v":"ELEVADOR DE USO RESTRITO, CAPACIDADE DE CARGA 225 KG OU MAIOR, 3 PESSOAS, ACABAMENTO AÇO INÓX ESCOVADO, EM ACORDO COM A NBR 12.892 E ITENS DE ACESSIBILIDADE"},{"$f":"IF(OFFSET(PO!O$12,ROW(D139)-ROW(D$12),0)=0,\"\",OFFSET(PO!O$12,ROW(D139)-ROW(D$12),0))","v":"UN"},{"$f":"IF($A139<>\"Serviço\",0,ROUND(SUMIF($F$9:$P$9,\"<>\",$F139:$P139),15-13*PO!$X$3))","v":1},null,1]
[{"$f":"OFFSET(PO!J$12,ROW(A140)-ROW($A$12),0)","v":"Serviço"},{"$f":"IF($A140=0,\"\",OFFSET(PO!K$12,ROW(B140)-ROW(B$12),0))","v":"1.18.2."},{"$f":"IF(OFFSET(PO!N$12,ROW(C140)-ROW(C$12),0)=0,\"\",OFFSET(PO!N$12,ROW(C140)-ROW(C$12),0))","v":"FORNECIMENTO/INSTALACAO LONA PLASTICA PRETA, PARA IMPERMEABILIZACAO, ESPESSURA 150 MICRAS."},{"$f":"IF(OFFSET(PO!O$12,ROW(D140)-ROW(D$12),0)=0,\"\",OFFSET(PO!O$12,ROW(D140)-ROW(D$12),0))","v":"M2"},{"$f":"IF($A140<>\"Serviço\",0,ROUND(SUMIF($F$9:$P$9,\"<>\",$F140:$P140),15-13*PO!$X$3))","v":113.9},113.9]
[{"$f":"OFFSET(PO!J$12,ROW(A141)-ROW($A$12),0)","v":"Serviço"},{"$f":"IF($A141=0,\"\",OFFSET(PO!K$12,ROW(B141)-ROW(B$12),0))","v":"1.18.3."},{"$f":"IF(OFFSET(PO!N$12,ROW(C141)-ROW(C$12),0)=0,\"\",OFFSET(PO!N$12,ROW(C141)-ROW(C$12),0))","v":"EXECUÇÃO DE PASSEIO (CALÇADA) OU PISO DE CONCRETO COM CONCRETO MOLDADO IN LOCO, FEITO EM OBRA, ACABAMENTO CONVENCIONAL, ESPESSURA 6 CM, ARMADO. "},{"$f":"IF(OFFSET(PO!O$12,ROW(D141)-ROW(D$12),0)=0,\"\",OFFSET(PO!O$12,ROW(D141)-ROW(D$12),0))","v":"M2"},{"$f":"IF($A141<>\"Serviço\",0,ROUND(SUMIF($F$9:$P$9,\"<>\",$F141:$P141),15-13*PO!$X$3))","v":113.9},113.9]
[{"$f":"OFFSET(PO!J$12,ROW(A142)-ROW($A$12),0)","v":"Serviço"},{"$f":"IF($A142=0,\"\",OFFSET(PO!K$12,ROW(B142)-ROW(B$12),0))","v":"1.18.4."},{"$f":"IF(OFFSET(PO!N$12,ROW(C142)-ROW(C$12),0)=0,\"\",OFFSET(PO!N$12,ROW(C142)-ROW(C$12),0))","v":"PISO PODOTATIL DE CONCRETO ALERTA/DIRECIONAL *40 X 40 X 2,5*CM, SOBRE LASTRO DE CONCRETO ESPESSURA 3 CM E REJUNTE CIMENTICIO, EXCLUSO COLCHÃO"},{"$f":"IF(OFFSET(PO!O$12,ROW(D142)-ROW(D$12),0)=0,\"\",OFFSET(PO!O$12,ROW(D142)-ROW(D$12),0))","v":"M2"},{"$f":"IF($A142<>\"Serviço\",0,ROUND(SUMIF($F$9:$P$9,\"<>\",$F142:$P142),15-13*PO!$X$3))","v":8.16},8.16]
[{"$f":"OFFSET(PO!J$12,ROW(A143)-ROW($A$12),0)","v":"Serviço"},{"$f":"IF($A143=0,\"\",OFFSET(PO!K$12,ROW(B143)-ROW(B$12),0))","v":"1.18.5."},{"$f":"IF(OFFSET(PO!N$12,ROW(C143)-ROW(C$12),0)=0,\"\",OFFSET(PO!N$12,ROW(C143)-ROW(C$12),0))","v":"PINTURA ACRILICA PARA SINALIZAÇÃO HORIZONTAL EM PISO CIMENTADO"},{"$f":"IF(OFFSET(PO!O$12,ROW(D143)-ROW(D$12),0)=0,\"\",OFFSET(PO!O$12,ROW(D143)-ROW(D$12),0))","v":"M2"},{"$f":"IF($A143<>\"Serviço\",0,ROUND(SUMIF($F$9:$P$9,\"<>\",$F143:$P143),15-13*PO!$X$3))","v":5.3},5.3]
[{"$f":"OFFSET(PO!J$12,ROW(A144)-ROW($A$12),0)","v":"Serviço"},{"$f":"IF($A144=0,\"\",OFFSET(PO!K$12,ROW(B144)-ROW(B$12),0))","v":"1.18.6."},{"$f":"IF(OFFSET(PO!N$12,ROW(C144)-ROW(C$12),0)=0,\"\",OFFSET(PO!N$12,ROW(C144)-ROW(C$12),0))","v":"PLANTIO DE ARBUSTO COM ALTURA 50 A 70CM, EM CAVA DE 60X60X60CM"},{"$f":"IF(OFFSET(PO!O$12,ROW(D144)-ROW(D$12),0)=0,\"\",OFFSET(PO!O$12,ROW(D144)-ROW(D$12),0))","v":"UN"},{"$f":"IF($A144<>\"Serviço\",0,ROUND(SUMIF($F$9:$P$9,\"<>\",$F144:$P144),15-13*PO!$X$3))","v":10},10]
[{"$f":"OFFSET(PO!J$12,ROW(A145)-ROW($A$12),0)","v":"Serviço"},{"$f":"IF($A145=0,\"\",OFFSET(PO!K$12,ROW(B145)-ROW(B$12),0))","v":"1.18.7."},{"$f":"IF(OFFSET(PO!N$12,ROW(C145)-ROW(C$12),0)=0,\"\",OFFSET(PO!N$12,ROW(C145)-ROW(C$12),0))","v":"MURETA PARA FLOREIRA H:35CM, INCLUSO, CHAPISCO, EMBOÇO E PINTURA SOBRE LAJE"},{"$f":"IF(OFFSET(PO!O$12,ROW(D145)-ROW(D$12),0)=0,\"\",OFFSET(PO!O$12,ROW(D145)-ROW(D$12),0))","v":"M"},{"$f":"IF($A145<>\"Serviço\",0,ROUND(SUMIF($F$9:$P$9,\"<>\",$F145:$P145),15-13*PO!$X$3))","v":20.85},20.85]
[{"$f":"OFFSET(PO!J$12,ROW(A146)-ROW($A$12),0)","v":"Nível 2"},{"$f":"IF($A146=0,\"\",OFFSET(PO!K$12,ROW(B146)-ROW(B$12),0))","v":"1.19."},{"$f":"IF(OFFSET(PO!N$12,ROW(C146)-ROW(C$12),0)=0,\"\",OFFSET(PO!N$12,ROW(C146)-ROW(C$12),0))","v":"PREVENTIVO DE INCÊNDIO"},{"$f":"IF(OFFSET(PO!O$12,ROW(D146)-ROW(D$12),0)=0,\"\",OFFSET(PO!O$12,ROW(D146)-ROW(D$12),0))","v":""},{"$f":"IF($A146<>\"Serviço\",0,ROUND(SUMIF($F$9:$P$9,\"<>\",$F146:$P146),15-13*PO!$X$3))","v":0},0]
[{"$f":"OFFSET(PO!J$12,ROW(A147)-ROW($A$12),0)","v":"Serviço"},{"$f":"IF($A147=0,\"\",OFFSET(PO!K$12,ROW(B147)-ROW(B$12),0))","v":"1.19.1."},{"$f":"IF(OFFSET(PO!N$12,ROW(C147)-ROW(C$12),0)=0,\"\",OFFSET(PO!N$12,ROW(C147)-ROW(C$12),0))","v":"EXTINTOR DE PQS 4KG - FORNECIMENTO E INSTALACAO"},{"$f":"IF(OFFSET(PO!O$12,ROW(D147)-ROW(D$12),0)=0,\"\",OFFSET(PO!O$12,ROW(D147)-ROW(D$12),0))","v":"UN"},{"$f":"IF($A147<>\"Serviço\",0,ROUND(SUMIF($F$9:$P$9,\"<>\",$F147:$P147),15-13*PO!$X$3))","v":4},2,2]
[{"$f":"OFFSET(PO!J$12,ROW(A148)-ROW($A$12),0)","v":"Serviço"},{"$f":"IF($A148=0,\"\",OFFSET(PO!K$12,ROW(B148)-ROW(B$12),0))","v":"1.19.2."},{"$f":"IF(OFFSET(PO!N$12,ROW(C148)-ROW(C$12),0)=0,\"\",OFFSET(PO!N$12,ROW(C148)-ROW(C$12),0))","v":"LUMINARIA DE EMERGENCIA 30 LEDS, POTENCIA 2 W, BATERIA DE LITIO, AUTONOMIA DE 6 HORAS"},{"$f":"IF(OFFSET(PO!O$12,ROW(D148)-ROW(D$12),0)=0,\"\",OFFSET(PO!O$12,ROW(D148)-ROW(D$12),0))","v":"UN"},{"$f":"IF($A148<>\"Serviço\",0,ROUND(SUMIF($F$9:$P$9,\"<>\",$F148:$P148),15-13*PO!$X$3))","v":12},6,6]
[{"$f":"OFFSET(PO!J$12,ROW(A149)-ROW($A$12),0)","v":"Serviço"},{"$f":"IF($A149=0,\"\",OFFSET(PO!K$12,ROW(B149)-ROW(B$12),0))","v":"1.19.3."},{"$f":"IF(OFFSET(PO!N$12,ROW(C149)-ROW(C$12),0)=0,\"\",OFFSET(PO!N$12,ROW(C149)-ROW(C$12),0))","v":"LUMINÁRIA DE EMERGÊNCIA, BLOCO AUTONOMO 2 x 55 LEDS, FORNECIMENTO E INSTALAÇÃO"},{"$f":"IF(OFFSET(PO!O$12,ROW(D149)-ROW(D$12),0)=0,\"\",OFFSET(PO!O$12,ROW(D149)-ROW(D$12),0))","v":"UN"},{"$f":"IF($A149<>\"Serviço\",0,ROUND(SUMIF($F$9:$P$9,\"<>\",$F149:$P149),15-13*PO!$X$3))","v":4},2,2]
[{"$f":"OFFSET(PO!J$12,ROW(A150)-ROW($A$12),0)","v":"Serviço"},{"$f":"IF($A150=0,\"\",OFFSET(PO!K$12,ROW(B150)-ROW(B$12),0))","v":"1.19.4."},{"$f":"IF(OFFSET(PO!N$12,ROW(C150)-ROW(C$12),0)=0,\"\",OFFSET(PO!N$12,ROW(C150)-ROW(C$12),0))","v":"PLACA DE SINALIZACAO DE SEGURANCA CONTRA INCENDIO, FOTOLUMINESCENTE, RETANGULAR, *20 X 40* CM, EM PVC *2* MM ANTI-CHAMAS (SIMBOLOS, CORES E PICTOGRAMAS CONFORME NBR 13434)"},{"$f":"IF(OFFSET(PO!O$12,ROW(D150)-ROW(D$12),0)=0,\"\",OFFSET(PO!O$12,ROW(D150)-ROW(D$12),0))","v":"UN"},{"$f":"IF($A150<>\"Serviço\",0,ROUND(SUMIF($F$9:$P$9,\"<>\",$F150:$P150),15-13*PO!$X$3))","v":16},7,9]
[{"$f":"OFFSET(PO!J$12,ROW(A151)-ROW($A$12),0)","v":"Serviço"},{"$f":"IF($A151=0,\"\",OFFSET(PO!K$12,ROW(B151)-ROW(B$12),0))","v":"1.19.5."},{"$f":"IF(OFFSET(PO!N$12,ROW(C151)-ROW(C$12),0)=0,\"\",OFFSET(PO!N$12,ROW(C151)-ROW(C$12),0))","v":"TUBO EM COBRE RÍGIDO, DN 28 CLASSE E, SEM ISOLAMENTO, INSTALADO EM RAMAL E SUB-RAMAL - FORNECIMENTO E INSTALAÇÃO"},{"$f":"IF(OFFSET(PO!O$12,ROW(D151)-ROW(D$12),0)=0,\"\",OFFSET(PO!O$12,ROW(D151)-ROW(D$12),0))","v":"M"},{"$f":"IF($A151<>\"Serviço\",0,ROUND(SUMIF($F$9:$P$9,\"<>\",$F151:$P151),15-13*PO!$X$3))","v":2.5},2.5]
[{"$f":"OFFSET(PO!J$12,ROW(A152)-ROW($A$12),0)","v":"Serviço"},{"$f":"IF($A152=0,\"\",OFFSET(PO!K$12,ROW(B152)-ROW(B$12),0))","v":"1.19.6."},{"$f":"IF(OFFSET(PO!N$12,ROW(C152)-ROW(C$12),0)=0,\"\",OFFSET(PO!N$12,ROW(C152)-ROW(C$12),0))","v":"NIPLE, EM FERRO GALVANIZADO, CONEXÃO ROSQUEADA, DN 15 (1/2\"), INSTALADO EM RAMAIS E SUB-RAMAIS DE GÁS - FORNECIMENTO E INSTALAÇÃO"},{"$f":"IF(OFFSET(PO!O$12,ROW(D152)-ROW(D$12),0)=0,\"\",OFFSET(PO!O$12,ROW(D152)-ROW(D$12),0))","v":"UN"},{"$f":"IF($A152<>\"Serviço\",0,ROUND(SUMIF($F$9:$P$9,\"<>\",$F152:$P152),15-13*PO!$X$3))","v":2},2]
[{"$f":"OFFSET(PO!J$12,ROW(A153)-ROW($A$12),0)","v":"Serviço"},{"$f":"IF($A153=0,\"\",OFFSET(PO!K$12,ROW(B153)-ROW(B$12),0))","v":"1.19.7."},{"$f":"IF(OFFSET(PO!N$12,ROW(C153)-ROW(C$12),0)=0,\"\",OFFSET(PO!N$12,ROW(C153)-ROW(C$12),0))","v":"ABRIGO DE GÁS - 2 BOTIJÕES"},{"$f":"IF(OFFSET(PO!O$12,ROW(D153)-ROW(D$12),0)=0,\"\",OFFSET(PO!O$12,ROW(D153)-ROW(D$12),0))","v":"Unid"},{"$f":"IF($A153<>\"Serviço\",0,ROUND(SUMIF($F$9:$P$9,\"<>\",$F153:$P153),15-13*PO!$X$3))","v":1},1]
[{"$f":"OFFSET(PO!J$12,ROW(A154)-ROW($A$12),0)","v":"Nível 2"},{"$f":"IF($A154=0,\"\",OFFSET(PO!K$12,ROW(B154)-ROW(B$12),0))","v":"1.20."},{"$f":"IF(OFFSET(PO!N$12,ROW(C154)-ROW(C$12),0)=0,\"\",OFFSET(PO!N$12,ROW(C154)-ROW(C$12),0))","v":"ACESSIBILIDADE"},{"$f":"IF(OFFSET(PO!O$12,ROW(D154)-ROW(D$12),0)=0,\"\",OFFSET(PO!O$12,ROW(D154)-ROW(D$12),0))","v":""},{"$f":"IF($A154<>\"Serviço\",0,ROUND(SUMIF($F$9:$P$9,\"<>\",$F154:$P154),15-13*PO!$X$3))","v":0},0]
[{"$f":"OFFSET(PO!J$12,ROW(A155)-ROW($A$12),0)","v":"Serviço"},{"$f":"IF($A155=0,\"\",OFFSET(PO!K$12,ROW(B155)-ROW(B$12),0))","v":"1.20.1."},{"$f":"IF(OFFSET(PO!N$12,ROW(C155)-ROW(C$12),0)=0,\"\",OFFSET(PO!N$12,ROW(C155)-ROW(C$12),0))","v":"PISO TÁTIL EM BORRACHA SINTÉTICA ALERTA E DIRECIONAL 250X250X5MM, COR AZUL OU PRETA"},{"$f":"IF(OFFSET(PO!O$12,ROW(D155)-ROW(D$12),0)=0,\"\",OFFSET(PO!O$12,ROW(D155)-ROW(D$12),0))","v":"M2"},{"$f":"IF($A155<>\"Serviço\",0,ROUND(SUMIF($F$9:$P$9,\"<>\",$F155:$P155),15-13*PO!$X$3))","v":2.5},2.5]
[{"$f":"OFFSET(PO!J$12,ROW(A156)-ROW($A$12),0)","v":"Serviço"},{"$f":"IF($A156=0,\"\",OFFSET(PO!K$12,ROW(B156)-ROW(B$12),0))","v":"1.20.2."},{"$f":"IF(OFFSET(PO!N$12,ROW(C156)-ROW(C$12),0)=0,\"\",OFFSET(PO!N$12,ROW(C156)-ROW(C$12),0))","v":"PLACA TÁTIL BRAILLE/RELEVO ACRÍLICO 30X14CM - USO SINALIZAÇÃO DE PORTAS DIVERSAS (04 PALAVRAS)"},{"$f":"IF(OFFSET(PO!O$12,ROW(D156)-ROW(D$12),0)=0,\"\",OFFSET(PO!O$12,ROW(D156)-ROW(D$12),0))","v":"UN"},{"$f":"IF($A156<>\"Serviço\",0,ROUND(SUMIF($F$9:$P$9,\"<>\",$F156:$P156),15-13*PO!$X$3))","v":5},3,2]
[{"$f":"OFFSET(PO!J$12,ROW(A157)-ROW($A$12),0)","v":"Serviço"},{"$f":"IF($A157=0,\"\",OFFSET(PO!K$12,ROW(B157)-ROW(B$12),0))","v":"1.20.3."},{"$f":"IF(OFFSET(PO!N$12,ROW(C157)-ROW(C$12),0)=0,\"\",OFFSET(PO!N$12,ROW(C157)-ROW(C$12),0))","v":"PLACA TÁTIL BRAILLE/RELEVO AÇO INÓX 100X30MM - PERSONALIZADO USO CORRIMÃO"},{"$f":"IF(OFFSET(PO!O$12,ROW(D157)-ROW(D$12),0)=0,\"\",OFFSET(PO!O$12,ROW(D157)-ROW(D$12),0))","v":"UN"},{"$f":"IF($A157<>\"Serviço\",0,ROUND(SUMIF($F$9:$P$9,\"<>\",$F157:$P157),15-13*PO!$X$3))","v":2},null,2]
[{"$f":"OFFSET(PO!J$12,ROW(A158)-ROW($A$12),0)","v":"Serviço"},{"$f":"IF($A158=0,\"\",OFFSET(PO!K$12,ROW(B158)-ROW(B$12),0))","v":"1.20.4."},{"$f":"IF(OFFSET(PO!N$12,ROW(C158)-ROW(C$12),0)=0,\"\",OFFSET(PO!N$12,ROW(C158)-ROW(C$12),0))","v":"SINALIZADOR VISUAL DE DEGRAUS FOTOLUMINESCENTE AMARELO 70X30MM"},{"$f":"IF(OFFSET(PO!O$12,ROW(D158)-ROW(D$12),0)=0,\"\",OFFSET(PO!O$12,ROW(D158)-ROW(D$12),0))","v":"UN"},{"$f":"IF($A158<>\"Serviço\",0,ROUND(SUMIF($F$9:$P$9,\"<>\",$F158:$P158),15-13*PO!$X$3))","v":50},25,25]
[{"$f":"OFFSET(PO!J$12,ROW(A159)-ROW($A$12),0)","v":"Serviço"},{"$f":"IF($A159=0,\"\",OFFSET(PO!K$12,ROW(B159)-ROW(B$12),0))","v":"1.20.5."},{"$f":"IF(OFFSET(PO!N$12,ROW(C159)-ROW(C$12),0)=0,\"\",OFFSET(PO!N$12,ROW(C159)-ROW(C$12),0))","v":"PLACA VINIL AUTOADESIVA COM SIMBOLOS DIVERSOS 150X200MM"},{"$f":"IF(OFFSET(PO!O$12,ROW(D159)-ROW(D$12),0)=0,\"\",OFFSET(PO!O$12,ROW(D159)-ROW(D$12),0))","v":"UN"},{"$f":"IF($A159<>\"Serviço\",0,ROUND(SUMIF($F$9:$P$9,\"<>\",$F159:$P159),15-13*PO!$X$3))","v":4},2,2]
[{"$f":"OFFSET(PO!J$12,ROW(A160)-ROW($A$12),0)","v":"Serviço"},{"$f":"IF($A160=0,\"\",OFFSET(PO!K$12,ROW(B160)-ROW(B$12),0))","v":"1.20.6."},{"$f":"IF(OFFSET(PO!N$12,ROW(C160)-ROW(C$12),0)=0,\"\",OFFSET(PO!N$12,ROW(C160)-ROW(C$12),0))","v":"PROTETOR DE IMPACTO PARA PORTA EM BORRACHA PRETA OU AZUL - ALTURA DE 40CM E LARGURA DE 80 OU 90CM"},{"$f":"IF(OFFSET(PO!O$12,ROW(D160)-ROW(D$12),0)=0,\"\",OFFSET(PO!O$12,ROW(D160)-ROW(D$12),0))","v":"UN"},{"$f":"IF($A160<>\"Serviço\",0,ROUND(SUMIF($F$9:$P$9,\"<>\",$F160:$P160),15-13*PO!$X$3))","v":8},4,4]
[{"$f":"OFFSET(PO!J$12,ROW(A161)-ROW($A$12),0)","v":"Serviço"},{"$f":"IF($A161=0,\"\",OFFSET(PO!K$12,ROW(B161)-ROW(B$12),0))","v":"1.20.7."},{"$f":"IF(OFFSET(PO!N$12,ROW(C161)-ROW(C$12),0)=0,\"\",OFFSET(PO!N$12,ROW(C161)-ROW(C$12),0))","v":"BARRA DE APOIO  RETA, EM AÇO INOX POLIDO 40CM"},{"$f":"IF(OFFSET(PO!O$12,ROW(D161)-ROW(D$12),0)=0,\"\",OFFSET(PO!O$12,ROW(D161)-ROW(D$12),0))","v":"UN"},{"$f":"IF($A161<>\"Serviço\",0,ROUND(SUMIF($F$9:$P$9,\"<>\",$F161:$P161),15-13*PO!$X$3))","v":16},8,8]
[{"$f":"OFFSET(PO!J$12,ROW(A162)-ROW($A$12),0)","v":"Serviço"},{"$f":"IF($A162=0,\"\",OFFSET(PO!K$12,ROW(B162)-ROW(B$12),0))","v":"1.20.8."},{"$f":"IF(OFFSET(PO!N$12,ROW(C162)-ROW(C$12),0)=0,\"\",OFFSET(PO!N$12,ROW(C162)-ROW(C$12),0))","v":"BARRA DE APOIO RETA, EM ACO INOX POLIDO, COMPRIMENTO 80CM, DIAMETRO MINIMO 3 CM"},{"$f":"IF(OFFSET(PO!O$12,ROW(D162)-ROW(D$12),0)=0,\"\",OFFSET(PO!O$12,ROW(D162)-ROW(D$12),0))","v":"UN"},{"$f":"IF($A162<>\"Serviço\",0,ROUND(SUMIF($F$9:$P$9,\"<>\",$F162:$P162),15-13*PO!$X$3))","v":8},4,4]
[{"$f":"OFFSET(PO!J$12,ROW(A163)-ROW($A$12),0)","v":"Serviço"},{"$f":"IF($A163=0,\"\",OFFSET(PO!K$12,ROW(B163)-ROW(B$12),0))","v":"1.20.9."},{"$f":"IF(OFFSET(PO!N$12,ROW(C163)-ROW(C$12),0)=0,\"\",OFFSET(PO!N$12,ROW(C163)-ROW(C$12),0))","v":"BARRA DE APOIO RETA, EM ACO INOX POLIDO, COMPRIMENTO 70CM, DIAMETRO MINIMO 3 CM"},{"$f":"IF(OFFSET(PO!O$12,ROW(D163)-ROW(D$12),0)=0,\"\",OFFSET(PO!O$12,ROW(D163)-ROW(D$12),0))","v":"UN"},{"$f":"IF($A163<>\"Serviço\",0,ROUND(SUMIF($F$9:$P$9,\"<>\",$F163:$P163),15-13*PO!$X$3))","v":4},2,2]
[{"$f":"OFFSET(PO!J$12,ROW(A164)-ROW($A$12),0)","v":"Serviço"},{"$f":"IF($A164=0,\"\",OFFSET(PO!K$12,ROW(B164)-ROW(B$12),0))","v":"1.20.10."},{"$f":"IF(OFFSET(PO!N$12,ROW(C164)-ROW(C$12),0)=0,\"\",OFFSET(PO!N$12,ROW(C164)-ROW(C$12),0))","v":"SIRENE AUDIOVISUAL PCD (NBR 9050)"},{"$f":"IF(OFFSET(PO!O$12,ROW(D164)-ROW(D$12),0)=0,\"\",OFFSET(PO!O$12,ROW(D164)-ROW(D$12),0))","v":"UN"},{"$f":"IF($A164<>\"Serviço\",0,ROUND(SUMIF($F$9:$P$9,\"<>\",$F164:$P164),15-13*PO!$X$3))","v":4},2,2]
[{"$f":"OFFSET(PO!J$12,ROW(A165)-ROW($A$12),0)","v":"Nível 2"},{"$f":"IF($A165=0,\"\",OFFSET(PO!K$12,ROW(B165)-ROW(B$12),0))","v":"1.21."},{"$f":"IF(OFFSET(PO!N$12,ROW(C165)-ROW(C$12),0)=0,\"\",OFFSET(PO!N$12,ROW(C165)-ROW(C$12),0))","v":"SERVIÇOS FINAIS"},{"$f":"IF(OFFSET(PO!O$12,ROW(D165)-ROW(D$12),0)=0,\"\",OFFSET(PO!O$12,ROW(D165)-ROW(D$12),0))","v":""},{"$f":"IF($A165<>\"Serviço\",0,ROUND(SUMIF($F$9:$P$9,\"<>\",$F165:$P165),15-13*PO!$X$3))","v":0},0]
[{"$f":"OFFSET(PO!J$12,ROW(A166)-ROW($A$12),0)","v":"Serviço"},{"$f":"IF($A166=0,\"\",OFFSET(PO!K$12,ROW(B166)-ROW(B$12),0))","v":"1.21.1."},{"$f":"IF(OFFSET(PO!N$12,ROW(C166)-ROW(C$12),0)=0,\"\",OFFSET(PO!N$12,ROW(C166)-ROW(C$12),0))","v":"LIMPEZA FINAL DA OBRA"},{"$f":"IF(OFFSET(PO!O$12,ROW(D166)-ROW(D$12),0)=0,\"\",OFFSET(PO!O$12,ROW(D166)-ROW(D$12),0))","v":"M2"},{"$f":"IF($A166<>\"Serviço\",0,ROUND(SUMIF($F$9:$P$9,\"<>\",$F166:$P166),15-13*PO!$X$3))","v":630.77},630.77]
[]
[]
[null,{"$f":"PO!$K$178","v":"VARGEM BONITA/SC"}]
[null,"Local"]
[]
[null,{"$f":"PO!$K$181","v":"2019-03-18"}]
[null,"Data"]

{"sheet":"CFF","index":6,"n_rows":57,"n_cols":29,"rows_kept":57,"cut":false,"hidden":false,"merged":[[47,11,49,11],[47,12,49,12],[47,13,49,13],[7,11,7,12],[10,13,12,13],[17,12,19,12],[17,13,19,13],[20,11,22,11],[20,12,22,12],[20,13,22,13],[32,12,34,12],[32,13,34,13],[35,11,37,11],[35,12,37,12],[35,13,37,13],[44,11,46,11],[54,16,54,18],[54,12,54,13],[53,16,53,18],[52,16,52,18],[52,11,52,13],[53,12,53,13],[55,11,55,13],[10,11,12,11],[10,12,12,12],[13,11,16,12],[13,13,16,13],[17,11,19,11],[23,11,25,11],[23,12,25,12],[23,13,25,13],[26,11,28,11],[26,12,28,12],[26,13,28,13],[29,11,31,11],[29,12,31,12],[29,13,31,13],[32,11,34,11],[44,12,46,12],[44,13,46,13],[38,11,40,11],[38,12,40,12],[38,13,40,13],[41,11,43,11],[41,12,43,12],[41,13,43,13]]}
[null,null,null,null,null,null,null,null,null,null,null,null,null,null,"    CFF -","CRONOGRAMA FÍSICO-FINANCEIRO"]
[null,null,null,null,null,null,null,null,null,null,null,null,null,null,null,{"$f":"CHOOSE(1+LOG(1+2*(TipoOrçamento=\"BASE\")+4*(TipoOrçamento=\"LICITADO\")+8*(TipoOrçamento=\"REPROGRAMADOAC\")+16*(TipoOrçamento=\"REPROGRAMADONPL\"),2),\"nada\",\"Cronograma Base para Licitação\",\"Cronograma Licitado\",\"Cronograma Licitado Reprogramado\",\"Cronograma Base para Licitação - Reprogramado\")","v":"Cronograma Base para Licitação"}]
[]
[]
[]
[]
[]
["Nível Máx Crono",null,null,null,null,null,null,null,null,null,null,{"$f":"IF(MAX($A$14:$A$52)<>MAX(PO!$V$12:$V$167),\"ERRO: CRONOGRAMA DESATUALIZADO\",IF(OR(COUNTIF($O$16:$X$16,\">1\")>0,OFFSET($X$17,0,-1)<>$N$14),\"ERRO: CRONOGRAMA NÃO FECHA EM 100%\",\"\"))","v":"ERRO: CRONOGRAMA DESATUALIZADO"},null,{"$f":"IF(TipoOrçamento=\"REPROGRAMADOAC\",\"Qtde de Medições realizadas\",\"\")","v":""}]
[2,null,null,null,null,null,null,null,null,null,null,null,null,1,{"$f":"IF(AND(TipoOrçamento=\"REPROGRAMADOAC\",$N$9>0),$N$9-1,0)","v":0},{"$f":"OFFSET(P9,0,-1)+1","v":1},2,3,4,5,6,7,8,null,null,null,null,null,{"$f":"OFFSET(AC9,0,-1)+1","v":1}]
["Lista Crono","Último Nível","Nível","Altura","N1","N2","N3","N4","Czero","Cnível","VTOTAL SOMA","Item","Descrição das Metas / Macrosserviços","Valores Totais (R$)",{"$f":"IF(TipoOrçamento=\"REPROGRAMADOAC\",\"Reinício de Obra\",\"Início de Obra\")&CHAR(10)&TEXT(DADOS!A48,\"dd/mm/aa\")","v":"Início de Obra\n01/11/18"},{"$f":"IF(AND(TipoOrçamento=\"REPROGRAMADOAC\",$N$9>0,N10=\"Valores Totais (R$)\"),\"Parcela \"&$N$9&\" Executado\",\"Parcela \"&P$9&CHAR(10)&TEXT(DATE(YEAR(DADOS!$A$48),MONTH(DADOS!$A$48)+P$9-IF(AND(TipoOrçamento=\"REPROGRAMADOAC\",$N$9>0),$N$9,0),1),\"mmm/aa\"))","v":"Parcela 1\ndez/18"},{"$f":"IF(AND(TipoOrçamento=\"REPROGRAMADOAC\",$N$9>0,O10=\"Valores Totais (R$)\"),\"Parcela \"&$N$9&\" Executado\",\"Parcela \"&Q$9&CHAR(10)&TEXT(DATE(YEAR(DADOS!$A$48),MONTH(DADOS!$A$48)+Q$9-IF(AND(TipoOrçamento=\"REPROGRAMADOAC\",$N$9>0),$N$9,0),1),\"mmm/aa\"))","v":"Parcela 2\njan/19"},{"$f":"IF(AND(TipoOrçamento=\"REPROGRAMADOAC\",$N$9>0,P10=\"Valores Totais (R$)\"),\"Parcela \"&$N$9&\" Executado\",\"Parcela \"&R$9&CHAR(10)&TEXT(DATE(YEAR(DADOS!$A$48),MONTH(DADOS!$A$48)+R$9-IF(AND(TipoOrçamento=\"REPROGRAMADOAC\",$N$9>0),$N$9,0),1),\"mmm/aa\"))","v":"Parcela 3\nfev/19"},{"$f":"IF(AND(TipoOrçamento=\"REPROGRAMADOAC\",$N$9>0,Q10=\"Valores Totais (R$)\"),\"Parcela \"&$N$9&\" Executado\",\"Parcela \"&S$9&CHAR(10)&TEXT(DATE(YEAR(DADOS!$A$48),MONTH(DADOS!$A$48)+S$9-IF(AND(TipoOrçamento=\"REPROGRAMADOAC\",$N$9>0),$N$9,0),1),\"mmm/aa\"))","v":"Parcela 4\nmar/19"},{"$f":"IF(AND(TipoOrçamento=\"REPROGRAMADOAC\",$N$9>0,R10=\"Valores Totais (R$)\"),\"Parcela \"&$N$9&\" Executado\",\"Parcela \"&T$9&CHAR(10)&TEXT(DATE(YEAR(DADOS!$A$48),MONTH(DADOS!$A$48)+T$9-IF(AND(TipoOrçamento=\"REPROGRAMADOAC\",$N$9>0),$N$9,0),1),\"mmm/aa\"))","v":"Parcela 5\nabr/19"},{"$f":"IF(AND(TipoOrçamento=\"REPROGRAMADOAC\",$N$9>0,S10=\"Valores Totais (R$)\"),\"Parcela \"&$N$9&\" Executado\",\"Parcela \"&U$9&CHAR(10)&TEXT(DATE(YEAR(DADOS!$A$48),MONTH(DADOS!$A$48)+U$9-IF(AND(TipoOrçamento=\"REPROGRAMADOAC\",$N$9>0),$N$9,0),1),\"mmm/aa\"))","v":"Parcela 6\nmai/19"},{"$f":"IF(AND(TipoOrçamento=\"REPROGRAMADOAC\",$N$9>0,T10=\"Valores Totais (R$)\"),\"Parcela \"&$N$9&\" Executado\",\"Parcela \"&V$9&CHAR(10)&TEXT(DATE(YEAR(DADOS!$A$48),MONTH(DADOS!$A$48)+V$9-IF(AND(TipoOrçamento=\"REPROGRAMADOAC\",$N$9>0),$N$9,0),1),\"mmm/aa\"))","v":"Parcela 7\njun/19"},{"$f":"IF(AND(TipoOrçamento=\"REPROGRAMADOAC\",$N$9>0,U10=\"Valores Totais (R$)\"),\"Parcela \"&$N$9&\" Executado\",\"Parcela \"&W$9&CHAR(10)&TEXT(DATE(YEAR(DADOS!$A$48),MONTH(DADOS!$A$48)+W$9-IF(AND(TipoOrçamento=\"REPROGRAMADOAC\",$N$9>0),$N$9,0),1),\"mmm/aa\"))","v":"Parcela 8\njul/19"},null,null,null,null,null,{"$f":"IF(AND(TipoOrçamento=\"REPROGRAMADOAC\",$N$9>0,AA10=\"Valores Totais (R$)\"),\"Parcela \"&$N$9&\" Executado\",\"Parcela \"&AC$9&CHAR(10)&TEXT(DATE(YEAR(DADOS!$A$48),MONTH(DADOS!$A$48)+AC$9-IF(AND(TipoOrçamento=\"REPROGRAMADOAC\",$N$9>0),$N$9,0),1),\"mmm/aa\"))","v":"Parcela 1\ndez/18"}]
[null,null,null,null,null,null,null,null,null,null,null,{"$f":"INDEX(PO!K$12:K$167,MATCH($A13,PO!$V$12:$V$167,0))","v":{"$error":"#VALUE!"}},{"$f":"INDEX(PO!N$12:N$167,MATCH($A13,PO!$V$12:$V$167,0))","v":{"$error":"#VALUE!"}},{"$f":"IF(ROUND(K13,2)=0,K13,ROUND(K13,2))","v":{"$error":"#VALUE!"}},"Parcela (%)",{"$f":"IF($B13,0,P12-IF(ISNUMBER(O12),O12,0))","v":{"$error":"#VALUE!"}},{"$f":"IF($B13,0,Q12-IF(ISNUMBER(P12),P12,0))","v":{"$error":"#VALUE!"}},{"$error":"#VALUE!"},{"$error":"#VALUE!"},{"$error":"#VALUE!"},{"$error":"#VALUE!"},{"$error":"#VALUE!"},{"$error":"#VALUE!"},null,null,null,null,null,{"$f":"IF($B13,0,AC12-IF(ISNUMBER(AB12),AB12,0))","v":{"$error":"#VALUE!"}}]
[null,null,null,null,null,null,null,null,null,null,null,null,null,null,"Acumulado (%)",{"$f":"MIN(IF($B13,P11+IF(ISNUMBER(O12),O12,0),P13/$N11),1)","v":{"$error":"#VALUE!"}},{"$f":"MIN(IF($B13,Q11+IF(ISNUMBER(P12),P12,0),Q13/$N11),1)","v":{"$error":"#VALUE!"}},{"$error":"#VALUE!"},{"$error":"#VALUE!"},{"$error":"#VALUE!"},{"$error":"#VALUE!"},{"$error":"#VALUE!"},{"$error":"#VALUE!"},null,null,null,null,null,{"$f":"MIN(IF($B13,AC11+IF(ISNUMBER(AB12),AB12,0),AC13/$N11),1)","v":{"$error":"#VALUE!"}}]
[{"$f":"OFFSET(A13,-CFF.NumLinha,0)+1","v":{"$error":"#VALUE!"}},{"$f":"$C13>=OFFSET($C13,CFF.NumLinha,0)","v":{"$error":"#VALUE!"}},{"$f":"INDEX(PO!A$12:A$167,MATCH($A13,PO!$V$12:$V$167,0))","v":{"$error":"#VALUE!"}},{"$f":"IF(ISERROR(J13),I13,SMALL(I13:J13,1))-1","v":{"$error":"#VALUE!"}},{"$f":"IF($C13=1,OFFSET(E13,-CFF.NumLinha,0)+1,OFFSET(E13,-CFF.NumLinha,0))","v":{"$error":"#VALUE!"}},{"$f":"IF($C13=1,0,IF($C13=2,OFFSET(F13,-CFF.NumLinha,0)+1,OFFSET(F13,-CFF.NumLinha,0)))","v":{"$error":"#VALUE!"}},{"$f":"IF(AND($C13<=2,$C13<>0),0,IF($C13=3,OFFSET(G13,-CFF.NumLinha,0)+1,OFFSET(G13,-CFF.NumLinha,0)))","v":{"$error":"#VALUE!"}},{"$f":"IF(AND($C13<=3,$C13<>0),0,IF($C13=4,OFFSET(H13,-CFF.NumLinha,0)+1,OFFSET(H13,-CFF.NumLinha,0)))","v":{"$error":"#VALUE!"}},{"$f":"MATCH(0,OFFSET($D13,1,$C13,ROW($A$51)-ROW($A13)),0)","v":{"$error":"#VALUE!"}},{"$f":"MATCH(OFFSET($D13,0,$C13)+1,OFFSET($D13,1,$C13,ROW($A$51)-ROW($A13)),0)","v":{"$error":"#VALUE!"}},{"$f":"ROUND(INDEX(PO!T$12:T$167,MATCH($A13,PO!$V$12:$V$167,0)),2)+10^-12","v":{"$error":"#VALUE!"}},null,null,null,"Acumulado (R$)",{"$f":"IF($B13,ROUND(P12*$N11,2),ROUND(SUMIF(OFFSET($B13,1,0,$D13),TRUE,OFFSET(P13,1,0,$D13))/SUMIF(OFFSET($B13,1,0,$D13),TRUE,OFFSET($K13,1,0,$D13))*$N11,2))","v":{"$error":"#VALUE!"}},{"$f":"IF($B13,ROUND(Q12*$N11,2),ROUND(SUMIF(OFFSET($B13,1,0,$D13),TRUE,OFFSET(Q13,1,0,$D13))/SUMIF(OFFSET($B13,1,0,$D13),TRUE,OFFSET($K13,1,0,$D13))*$N11,2))","v":{"$error":"#VALUE!"}},{"$error":"#VALUE!"},{"$error":"#VALUE!"},{"$error":"#VALUE!"},{"$error":"#VALUE!"},{"$error":"#VALUE!"},{"$error":"#VALUE!"},null,null,null,null,null,{"$f":"IF($B13,ROUND(AC12*$N11,2),ROUND(SUMIF(OFFSET($B13,1,0,$D13),TRUE,OFFSET(AC13,1,0,$D13))/SUMIF(OFFSET($B13,1,0,$D13),TRUE,OFFSET($K13,1,0,$D13))*$N11,2))","v":{"$error":"#VALUE!"}}]
[null,null,null,null,null,null,null,null,null,null,null,"CRONOGRAMA GLOBAL DO LOTE",null,{"$f":"IF(PO!$T$12=0,10^-12,PO!$T$12)","v":994610.41000000027},"Parcela (%)",{"$f":"ROUND(P15/$N14,4)","v":0.21579999999999999},{"$f":"ROUND(Q15/$N14,4)","v":0.78420000000000001},0,0,0,0,0,0,null,null,null,null,null,{"$f":"ROUND(AC15/$N14,4)","v":0}]
[null,null,null,null,null,null,null,null,null,null,null,null,null,null,"Parcela (R$)",{"$f":"P17-IF(ISNUMBER(O17),O17,0)","v":214675.62},{"$f":"Q17-IF(ISNUMBER(P17),P17,0)","v":779934.79},0,0,0,0,0,0,null,null,null,null,null,{"$f":"AC17-IF(ISNUMBER(AB17),AB17,0)","v":0}]
[null,null,null,null,null,null,null,null,null,null,null,null,null,null,"Acumulado (%)",{"$f":"ROUND(P17/$N14,4)","v":0.21579999999999999},{"$f":"ROUND(Q17/$N14,4)","v":1},1,1,1,1,1,1,null,null,null,null,null,{"$f":"ROUND(AC17/$N14,4)","v":0}]
[0,null,null,{"$f":"ROW(D$51)-ROW(D18)","v":33},null,null,null,null,null,null,null,null,null,null,"Acumulado (R$)",{"$f":"SUMIF(OFFSET($C17,1,0):$C$51,1,OFFSET(P17,1,0):P$51)","v":214675.62},{"$f":"SUMIF(OFFSET($C17,1,0):$C$51,1,OFFSET(Q17,1,0):Q$51)","v":994610.41},{"$f":"SUMIF(OFFSET($C17,1,0):$C$51,1,OFFSET(R17,1,0):R$51)","v":994610.41},{"$f":"SUMIF(OFFSET($C17,1,0):$C$51,1,OFFSET(S17,1,0):S$51)","v":994610.41},{"$f":"SUMIF(OFFSET($C17,1,0):$C$51,1,OFFSET(T17,1,0):T$51)","v":994610.41},{"$f":"SUMIF(OFFSET($C17,1,0):$C$51,1,OFFSET(U17,1,0):U$51)","v":994610.41},{"$f":"SUMIF(OFFSET($C17,1,0):$C$51,1,OFFSET(V17,1,0):V$51)","v":994610.41},{"$f":"SUMIF(OFFSET($C17,1,0):$C$51,1,OFFSET(W17,1,0):W$51)","v":994610.41},null,null,null,null,null,{"$f":"SUMIF(OFFSET($C17,1,0):$C$51,1,OFFSET(AC17,1,0):AC$51)","v":0}]
[null,null,null,null,null,null,null,null,null,null,null,{"$f":"INDEX(PO!K$12:K$167,MATCH($A20,PO!$V$12:$V$167,0))","v":"1."},{"$f":"INDEX(PO!N$12:N$167,MATCH($A20,PO!$V$12:$V$167,0))","v":"CASA DO PRODUTOR"},{"$f":"IF(ROUND(K20,2)=0,K20,ROUND(K20,2))","v":994610.41},"Parcela (%)",0.5,0.5,0.15,0.15,0.15,0.15,0.1,{"$f":"IF($B20,0,W19-IF(ISNUMBER(V19),V19,0))","v":0},"",null,null,null,null,{"$f":"IF($B20,0,AC19-IF(ISNUMBER(AB19),AB19,0))","v":0}]
[null,null,null,null,null,null,null,null,null,null,null,null,null,null,"Acumulado (%)",{"$f":"MIN(IF($B20,P18+IF(ISNUMBER(O19),O19,0),P20/$N18),1)","v":0.21583890319426677},1,1,1,1,1,1,1,null,null,null,null,null,{"$f":"MIN(IF($B20,AC18+IF(ISNUMBER(AB19),AB19,0),AC20/$N18),1)","v":0}]
[{"$f":"OFFSET(A20,-CFF.NumLinha,0)+1","v":1},{"$f":"$C20>=OFFSET($C20,CFF.NumLinha,0)","v":false},{"$f":"INDEX(PO!A$12:A$167,MATCH($A20,PO!$V$12:$V$167,0))","v":1},{"$f":"IF(ISERROR(J20),I20,SMALL(I20:J20,1))-1","v":30},{"$f":"IF($C20=1,OFFSET(E20,-CFF.NumLinha,0)+1,OFFSET(E20,-CFF.NumLinha,0))","v":1},{"$f":"IF($C20=1,0,IF($C20=2,OFFSET(F20,-CFF.NumLinha,0)+1,OFFSET(F20,-CFF.NumLinha,0)))","v":0},{"$f":"IF(AND($C20<=2,$C20<>0),0,IF($C20=3,OFFSET(G20,-CFF.NumLinha,0)+1,OFFSET(G20,-CFF.NumLinha,0)))","v":0},{"$f":"IF(AND($C20<=3,$C20<>0),0,IF($C20=4,OFFSET(H20,-CFF.NumLinha,0)+1,OFFSET(H20,-CFF.NumLinha,0)))","v":0},{"$f":"MATCH(0,OFFSET($D20,1,$C20,ROW($A$51)-ROW($A20)),0)","v":31},{"$f":"MATCH(OFFSET($D20,0,$C20)+1,OFFSET($D20,1,$C20,ROW($A$51)-ROW($A20)),0)","v":{"$error":"#N/A"}},{"$f":"ROUND(INDEX(PO!T$12:T$167,MATCH($A20,PO!$V$12:$V$167,0)),2)+10^-12","v":994610.41},null,null,null,"Acumulado (R$)",{"$f":"IF($B20,ROUND(P19*$N18,2),ROUND(SUMIF(OFFSET($B20,1,0,$D20),TRUE,OFFSET(P20,1,0,$D20))/SUMIF(OFFSET($B20,1,0,$D20),TRUE,OFFSET($K20,1,0,$D20))*$N18,2))","v":214675.62},994610.41,994610.41,994610.41,994610.41,994610.41,994610.41,994610.41,null,null,null,null,null,{"$f":"IF($B20,ROUND(AC19*$N18,2),ROUND(SUMIF(OFFSET($B20,1,0,$D20),TRUE,OFFSET(AC20,1,0,$D20))/SUMIF(OFFSET($B20,1,0,$D20),TRUE,OFFSET($K20,1,0,$D20))*$N18,2))","v":0}]
[null,null,null,null,null,null,null,null,null,null,null,{"$f":"INDEX(PO!K$12:K$167,MATCH($A23,PO!$V$12:$V$167,0))","v":"1.1."},{"$f":"INDEX(PO!N$12:N$167,MATCH($A23,PO!$V$12:$V$167,0))","v":"SERVIÇOS INICIAIS"},{"$f":"IF(ROUND(K23,2)=0,K23,ROUND(K23,2))","v":2662.77},"Parcela (%)",1,0.5,null,4.4999999999999998E-2,{"$f":"IF($B23,0,T22-IF(ISNUMBER(S22),S22,0))","v":0},{"$f":"IF($B23,0,U22-IF(ISNUMBER(T22),T22,0))","v":0},{"$f":"IF($B23,0,V22-IF(ISNUMBER(U22),U22,0))","v":0},{"$f":"IF($B23,0,W22-IF(ISNUMBER(V22),V22,0))","v":0},null,null,null,null,null,{"$f":"IF($B23,0,AC22-IF(ISNUMBER(AB22),AB22,0))","v":0}]
[null,null,null,null,null,null,null,null,null,null,null,null,null,null,"Acumulado (%)",{"$f":"MIN(IF($B23,P21+IF(ISNUMBER(O22),O22,0),P23/$N21),1)","v":1},{"$f":"MIN(IF($B23,Q21+IF(ISNUMBER(P22),P22,0),Q23/$N21),1)","v":1},{"$f":"MIN(IF($B23,R21+IF(ISNUMBER(Q22),Q22,0),R23/$N21),1)","v":1},{"$f":"MIN(IF($B23,S21+IF(ISNUMBER(R22),R22,0),S23/$N21),1)","v":1},{"$f":"MIN(IF($B23,T21+IF(ISNUMBER(S22),S22,0),T23/$N21),1)","v":1},{"$f":"MIN(IF($B23,U21+IF(ISNUMBER(T22),T22,0),U23/$N21),1)","v":1},{"$f":"MIN(IF($B23,V21+IF(ISNUMBER(U22),U22,0),V23/$N21),1)","v":1},{"$f":"MIN(IF($B23,W21+IF(ISNUMBER(V22),V22,0),W23/$N21),1)","v":1},null,null,null,null,null,{"$f":"MIN(IF($B23,AC21+IF(ISNUMBER(AB22),AB22,0),AC23/$N21),1)","v":0}]
[{"$f":"OFFSET(A23,-CFF.NumLinha,0)+1","v":2},{"$f":"$C23>=OFFSET($C23,CFF.NumLinha,0)","v":true},{"$f":"INDEX(PO!A$12:A$167,MATCH($A23,PO!$V$12:$V$167,0))","v":2},{"$f":"IF(ISERROR(J23),I23,SMALL(I23:J23,1))-1","v":2},{"$f":"IF($C23=1,OFFSET(E23,-CFF.NumLinha,0)+1,OFFSET(E23,-CFF.NumLinha,0))","v":1},{"$f":"IF($C23=1,0,IF($C23=2,OFFSET(F23,-CFF.NumLinha,0)+1,OFFSET(F23,-CFF.NumLinha,0)))","v":1},{"$f":"IF(AND($C23<=2,$C23<>0),0,IF($C23=3,OFFSET(G23,-CFF.NumLinha,0)+1,OFFSET(G23,-CFF.NumLinha,0)))","v":0},{"$f":"IF(AND($C23<=3,$C23<>0),0,IF($C23=4,OFFSET(H23,-CFF.NumLinha,0)+1,OFFSET(H23,-CFF.NumLinha,0)))","v":0},{"$f":"MATCH(0,OFFSET($D23,1,$C23,ROW($A$51)-ROW($A23)),0)","v":28},{"$f":"MATCH(OFFSET($D23,0,$C23)+1,OFFSET($D23,1,$C23,ROW($A$51)-ROW($A23)),0)","v":3},{"$f":"ROUND(INDEX(PO!T$12:T$167,MATCH($A23,PO!$V$12:$V$167,0)),2)+10^-12","v":2662.7700000000009},null,null,null,"Acumulado (R$)",{"$f":"IF($B23,ROUND(P22*$N21,2),ROUND(SUMIF(OFFSET($B23,1,0,$D23),TRUE,OFFSET(P23,1,0,$D23))/SUMIF(OFFSET($B23,1,0,$D23),TRUE,OFFSET($K23,1,0,$D23))*$N21,2))","v":2662.77},2662.77,2662.77,2662.77,2662.77,2662.77,2662.77,2662.77,null,null,null,null,null,{"$f":"IF($B23,ROUND(AC22*$N21,2),ROUND(SUMIF(OFFSET($B23,1,0,$D23),TRUE,OFFSET(AC23,1,0,$D23))/SUMIF(OFFSET($B23,1,0,$D23),TRUE,OFFSET($K23,1,0,$D23))*$N21,2))","v":0}]
[null,null,null,null,null,null,null,null,null,null,null,{"$f":"INDEX(PO!K$12:K$167,MATCH($A26,PO!$V$12:$V$167,0))","v":"1.2."},{"$f":"INDEX(PO!N$12:N$167,MATCH($A26,PO!$V$12:$V$167,0))","v":"ESCAVAÇÔES E REATERRO"},{"$f":"IF(ROUND(K26,2)=0,K26,ROUND(K26,2))","v":624.72},"Parcela (%)",0.5,0.5,{"$f":"IF($B26,0,R25-IF(ISNUMBER(Q25),Q25,0))","v":0},{"$f":"IF($B26,0,S25-IF(ISNUMBER(R25),R25,0))","v":0},{"$f":"IF($B26,0,T25-IF(ISNUMBER(S25),S25,0))","v":0},{"$f":"IF($B26,0,U25-IF(ISNUMBER(T25),T25,0))","v":0},{"$f":"IF($B26,0,V25-IF(ISNUMBER(U25),U25,0))","v":0},{"$f":"IF($B26,0,W25-IF(ISNUMBER(V25),V25,0))","v":0},null,null,null,null,null,{"$f":"IF($B26,0,AC25-IF(ISNUMBER(AB25),AB25,0))","v":0}]
[null,null,null,null,null,null,null,null,null,null,null,null,null,null,"Acumulado (%)",{"$f":"MIN(IF($B26,P24+IF(ISNUMBER(O25),O25,0),P26/$N24),1)","v":0.5},{"$f":"MIN(IF($B26,Q24+IF(ISNUMBER(P25),P25,0),Q26/$N24),1)","v":1},{"$f":"MIN(IF($B26,R24+IF(ISNUMBER(Q25),Q25,0),R26/$N24),1)","v":1},{"$f":"MIN(IF($B26,S24+IF(ISNUMBER(R25),R25,0),S26/$N24),1)","v":1},{"$f":"MIN(IF($B26,T24+IF(ISNUMBER(S25),S25,0),T26/$N24),1)","v":1},{"$f":"MIN(IF($B26,U24+IF(ISNUMBER(T25),T25,0),U26/$N24),1)","v":1},{"$f":"MIN(IF($B26,V24+IF(ISNUMBER(U25),U25,0),V26/$N24),1)","v":1},{"$f":"MIN(IF($B26,W24+IF(ISNUMBER(V25),V25,0),W26/$N24),1)","v":1},null,null,null,null,null,{"$f":"MIN(IF($B26,AC24+IF(ISNUMBER(AB25),AB25,0),AC26/$N24),1)","v":0}]
[{"$f":"OFFSET(A26,-CFF.NumLinha,0)+1","v":3},{"$f":"$C26>=OFFSET($C26,CFF.NumLinha,0)","v":true},{"$f":"INDEX(PO!A$12:A$167,MATCH($A26,PO!$V$12:$V$167,0))","v":2},{"$f":"IF(ISERROR(J26),I26,SMALL(I26:J26,1))-1","v":2},{"$f":"IF($C26=1,OFFSET(E26,-CFF.NumLinha,0)+1,OFFSET(E26,-CFF.NumLinha,0))","v":1},{"$f":"IF($C26=1,0,IF($C26=2,OFFSET(F26,-CFF.NumLinha,0)+1,OFFSET(F26,-CFF.NumLinha,0)))","v":2},{"$f":"IF(AND($C26<=2,$C26<>0),0,IF($C26=3,OFFSET(G26,-CFF.NumLinha,0)+1,OFFSET(G26,-CFF.NumLinha,0)))","v":0},{"$f":"IF(AND($C26<=3,$C26<>0),0,IF($C26=4,OFFSET(H26,-CFF.NumLinha,0)+1,OFFSET(H26,-CFF.NumLinha,0)))","v":0},{"$f":"MATCH(0,OFFSET($D26,1,$C26,ROW($A$51)-ROW($A26)),0)","v":25},{"$f":"MATCH(OFFSET($D26,0,$C26)+1,OFFSET($D26,1,$C26,ROW($A$51)-ROW($A26)),0)","v":3},{"$f":"ROUND(INDEX(PO!T$12:T$167,MATCH($A26,PO!$V$12:$V$167,0)),2)+10^-12","v":624.72000000000105},null,null,null,"Acumulado (R$)",{"$f":"IF($B26,ROUND(P25*$N24,2),ROUND(SUMIF(OFFSET($B26,1,0,$D26),TRUE,OFFSET(P26,1,0,$D26))/SUMIF(OFFSET($B26,1,0,$D26),TRUE,OFFSET($K26,1,0,$D26))*$N24,2))","v":312.36},624.72,624.72,624.72,624.72,624.72,624.72,624.72,null,null,null,null,null,{"$f":"IF($B26,ROUND(AC25*$N24,2),ROUND(SUMIF(OFFSET($B26,1,0,$D26),TRUE,OFFSET(AC26,1,0,$D26))/SUMIF(OFFSET($B26,1,0,$D26),TRUE,OFFSET($K26,1,0,$D26))*$N24,2))","v":0}]
[null,null,null,null,null,null,null,null,null,null,null,{"$f":"INDEX(PO!K$12:K$167,MATCH($A29,PO!$V$12:$V$167,0))","v":"1.3."},{"$f":"INDEX(PO!N$12:N$167,MATCH($A29,PO!$V$12:$V$167,0))","v":"FUNDAÇÕES: BLOCOS E BALDRAMES"},{"$f":"IF(ROUND(K29,2)=0,K29,ROUND(K29,2))","v":73549.06},"Parcela (%)",0.5,0.5,{"$f":"IF($B29,0,R28-IF(ISNUMBER(Q28),Q28,0))","v":0},{"$f":"IF($B29,0,S28-IF(ISNUMBER(R28),R28,0))","v":0},{"$f":"IF($B29,0,T28-IF(ISNUMBER(S28),S28,0))","v":0},{"$f":"IF($B29,0,U28-IF(ISNUMBER(T28),T28,0))","v":0},{"$f":"IF($B29,0,V28-IF(ISNUMBER(U28),U28,0))","v":0},{"$f":"IF($B29,0,W28-IF(ISNUMBER(V28),V28,0))","v":0},null,null,null,null,null,{"$f":"IF($B29,0,AC28-IF(ISNUMBER(AB28),AB28,0))","v":0}]
[null,null,null,null,null,null,null,null,null,null,null,null,null,null,"Acumulado (%)",{"$f":"MIN(IF($B29,P27+IF(ISNUMBER(O28),O28,0),P29/$N27),1)","v":0.5},{"$f":"MIN(IF($B29,Q27+IF(ISNUMBER(P28),P28,0),Q29/$N27),1)","v":1},{"$f":"MIN(IF($B29,R27+IF(ISNUMBER(Q28),Q28,0),R29/$N27),1)","v":1},{"$f":"MIN(IF($B29,S27+IF(ISNUMBER(R28),R28,0),S29/$N27),1)","v":1},{"$f":"MIN(IF($B29,T27+IF(ISNUMBER(S28),S28,0),T29/$N27),1)","v":1},{"$f":"MIN(IF($B29,U27+IF(ISNUMBER(T28),T28,0),U29/$N27),1)","v":1},{"$f":"MIN(IF($B29,V27+IF(ISNUMBER(U28),U28,0),V29/$N27),1)","v":1},{"$f":"MIN(IF($B29,W27+IF(ISNUMBER(V28),V28,0),W29/$N27),1)","v":1},null,null,null,null,null,{"$f":"MIN(IF($B29,AC27+IF(ISNUMBER(AB28),AB28,0),AC29/$N27),1)","v":0}]
[{"$f":"OFFSET(A29,-CFF.NumLinha,0)+1","v":4},{"$f":"$C29>=OFFSET($C29,CFF.NumLinha,0)","v":true},{"$f":"INDEX(PO!A$12:A$167,MATCH($A29,PO!$V$12:$V$167,0))","v":2},{"$f":"IF(ISERROR(J29),I29,SMALL(I29:J29,1))-1","v":2},{"$f":"IF($C29=1,OFFSET(E29,-CFF.NumLinha,0)+1,OFFSET(E29,-CFF.NumLinha,0))","v":1},{"$f":"IF($C29=1,0,IF($C29=2,OFFSET(F29,-CFF.NumLinha,0)+1,OFFSET(F29,-CFF.NumLinha,0)))","v":3},{"$f":"IF(AND($C29<=2,$C29<>0),0,IF($C29=3,OFFSET(G29,-CFF.NumLinha,0)+1,OFFSET(G29,-CFF.NumLinha,0)))","v":0},{"$f":"IF(AND($C29<=3,$C29<>0),0,IF($C29=4,OFFSET(H29,-CFF.NumLinha,0)+1,OFFSET(H29,-CFF.NumLinha,0)))","v":0},{"$f":"MATCH(0,OFFSET($D29,1,$C29,ROW($A$51)-ROW($A29)),0)","v":22},{"$f":"MATCH(OFFSET($D29,0,$C29)+1,OFFSET($D29,1,$C29,ROW($A$51)-ROW($A29)),0)","v":3},{"$f":"ROUND(INDEX(PO!T$12:T$167,MATCH($A29,PO!$V$12:$V$167,0)),2)+10^-12","v":73549.06},null,null,null,"Acumulado (R$)",{"$f":"IF($B29,ROUND(P28*$N27,2),ROUND(SUMIF(OFFSET($B29,1,0,$D29),TRUE,OFFSET(P29,1,0,$D29))/SUMIF(OFFSET($B29,1,0,$D29),TRUE,OFFSET($K29,1,0,$D29))*$N27,2))","v":36774.53},73549.06,73549.06,73549.06,73549.06,73549.06,73549.06,73549.06,null,null,null,null,null,{"$f":"IF($B29,ROUND(AC28*$N27,2),ROUND(SUMIF(OFFSET($B29,1,0,$D29),TRUE,OFFSET(AC29,1,0,$D29))/SUMIF(OFFSET($B29,1,0,$D29),TRUE,OFFSET($K29,1,0,$D29))*$N27,2))","v":0}]
[null,null,null,null,null,null,null,null,null,null,null,{"$f":"INDEX(PO!K$12:K$167,MATCH($A32,PO!$V$12:$V$167,0))","v":"1.4."},{"$f":"INDEX(PO!N$12:N$167,MATCH($A32,PO!$V$12:$V$167,0))","v":"ESTRUTURA: VIGAS "},{"$f":"IF(ROUND(K32,2)=0,K32,ROUND(K32,2))","v":59869.26},"Parcela (%)",{"$f":"IF($B32,0,P31-IF(ISNUMBER(O31),O31,0))","v":0},1,{"$f":"IF($B32,0,R31-IF(ISNUMBER(Q31),Q31,0))","v":0},{"$f":"IF($B32,0,S31-IF(ISNUMBER(R31),R31,0))","v":0},{"$f":"IF($B32,0,T31-IF(ISNUMBER(S31),S31,0))","v":0},{"$f":"IF($B32,0,U31-IF(ISNUMBER(T31),T31,0))","v":0},{"$f":"IF($B32,0,V31-IF(ISNUMBER(U31),U31,0))","v":0},{"$f":"IF($B32,0,W31-IF(ISNUMBER(V31),V31,0))","v":0},null,null,null,null,null,{"$f":"IF($B32,0,AC31-IF(ISNUMBER(AB31),AB31,0))","v":0}]
[null,null,null,null,null,null,null,null,null,null,null,null,null,null,"Acumulado (%)",{"$f":"MIN(IF($B32,P30+IF(ISNUMBER(O31),O31,0),P32/$N30),1)","v":0},{"$f":"MIN(IF($B32,Q30+IF(ISNUMBER(P31),P31,0),Q32/$N30),1)","v":1},{"$f":"MIN(IF($B32,R30+IF(ISNUMBER(Q31),Q31,0),R32/$N30),1)","v":1},{"$f":"MIN(IF($B32,S30+IF(ISNUMBER(R31),R31,0),S32/$N30),1)","v":1},{"$f":"MIN(IF($B32,T30+IF(ISNUMBER(S31),S31,0),T32/$N30),1)","v":1},{"$f":"MIN(IF($B32,U30+IF(ISNUMBER(T31),T31,0),U32/$N30),1)","v":1},{"$f":"MIN(IF($B32,V30+IF(ISNUMBER(U31),U31,0),V32/$N30),1)","v":1},{"$f":"MIN(IF($B32,W30+IF(ISNUMBER(V31),V31,0),W32/$N30),1)","v":1},null,null,null,null,null,{"$f":"MIN(IF($B32,AC30+IF(ISNUMBER(AB31),AB31,0),AC32/$N30),1)","v":0}]
[{"$f":"OFFSET(A32,-CFF.NumLinha,0)+1","v":5},{"$f":"$C32>=OFFSET($C32,CFF.NumLinha,0)","v":true},{"$f":"INDEX(PO!A$12:A$167,MATCH($A32,PO!$V$12:$V$167,0))","v":2},{"$f":"IF(ISERROR(J32),I32,SMALL(I32:J32,1))-1","v":2},{"$f":"IF($C32=1,OFFSET(E32,-CFF.NumLinha,0)+1,OFFSET(E32,-CFF.NumLinha,0))","v":1},{"$f":"IF($C32=1,0,IF($C32=2,OFFSET(F32,-CFF.NumLinha,0)+1,OFFSET(F32,-CFF.NumLinha,0)))","v":4},{"$f":"IF(AND($C32<=2,$C32<>0),0,IF($C32=3,OFFSET(G32,-CFF.NumLinha,0)+1,OFFSET(G32,-CFF.NumLinha,0)))","v":0},{"$f":"IF(AND($C32<=3,$C32<>0),0,IF($C32=4,OFFSET(H32,-CFF.NumLinha,0)+1,OFFSET(H32,-CFF.NumLinha,0)))","v":0},{"$f":"MATCH(0,OFFSET($D32,1,$C32,ROW($A$51)-ROW($A32)),0)","v":19},{"$f":"MATCH(OFFSET($D32,0,$C32)+1,OFFSET($D32,1,$C32,ROW($A$51)-ROW($A32)),0)","v":3},{"$f":"ROUND(INDEX(PO!T$12:T$167,MATCH($A32,PO!$V$12:$V$167,0)),2)+10^-12","v":59869.26},null,null,null,"Acumulado (R$)",{"$f":"IF($B32,ROUND(P31*$N30,2),ROUND(SUMIF(OFFSET($B32,1,0,$D32),TRUE,OFFSET(P32,1,0,$D32))/SUMIF(OFFSET($B32,1,0,$D32),TRUE,OFFSET($K32,1,0,$D32))*$N30,2))","v":0},59869.26,59869.26,59869.26,59869.26,59869.26,59869.26,59869.26,null,null,null,null,null,{"$f":"IF($B32,ROUND(AC31*$N30,2),ROUND(SUMIF(OFFSET($B32,1,0,$D32),TRUE,OFFSET(AC32,1,0,$D32))/SUMIF(OFFSET($B32,1,0,$D32),TRUE,OFFSET($K32,1,0,$D32))*$N30,2))","v":0}]
[null,null,null,null,null,null,null,null,null,null,null,{"$f":"INDEX(PO!K$12:K$167,MATCH($A35,PO!$V$12:$V$167,0))","v":"1.5."},{"$f":"INDEX(PO!N$12:N$167,MATCH($A35,PO!$V$12:$V$167,0))","v":"ESTRUTURA: PILARES"},{"$f":"IF(ROUND(K35,2)=0,K35,ROUND(K35,2))","v":50658.61},"Parcela (%)",{"$f":"IF($B35,0,P34-IF(ISNUMBER(O34),O34,0))","v":0},1,{"$f":"IF($B35,0,R34-IF(ISNUMBER(Q34),Q34,0))","v":0},{"$f":"IF($B35,0,S34-IF(ISNUMBER(R34),R34,0))","v":0},{"$f":"IF($B35,0,T34-IF(ISNUMBER(S34),S34,0))","v":0},{"$f":"IF($B35,0,U34-IF(ISNUMBER(T34),T34,0))","v":0},{"$f":"IF($B35,0,V34-IF(ISNUMBER(U34),U34,0))","v":0},{"$f":"IF($B35,0,W34-IF(ISNUMBER(V34),V34,0))","v":0},null,null,null,null,null,{"$f":"IF($B35,0,AC34-IF(ISNUMBER(AB34),AB34,0))","v":0}]
[null,null,null,null,null,null,null,null,null,null,null,null,null,null,"Acumulado (%)",{"$f":"MIN(IF($B35,P33+IF(ISNUMBER(O34),O34,0),P35/$N33),1)","v":0},{"$f":"MIN(IF($B35,Q33+IF(ISNUMBER(P34),P34,0),Q35/$N33),1)","v":1},{"$f":"MIN(IF($B35,R33+IF(ISNUMBER(Q34),Q34,0),R35/$N33),1)","v":1},{"$f":"MIN(IF($B35,S33+IF(ISNUMBER(R34),R34,0),S35/$N33),1)","v":1},{"$f":"MIN(IF($B35,T33+IF(ISNUMBER(S34),S34,0),T35/$N33),1)","v":1},{"$f":"MIN(IF($B35,U33+IF(ISNUMBER(T34),T34,0),U35/$N33),1)","v":1},{"$f":"MIN(IF($B35,V33+IF(ISNUMBER(U34),U34,0),V35/$N33),1)","v":1},{"$f":"MIN(IF($B35,W33+IF(ISNUMBER(V34),V34,0),W35/$N33),1)","v":1},null,null,null,null,null,{"$f":"MIN(IF($B35,AC33+IF(ISNUMBER(AB34),AB34,0),AC35/$N33),1)","v":0}]
[{"$f":"OFFSET(A35,-CFF.NumLinha,0)+1","v":6},{"$f":"$C35>=OFFSET($C35,CFF.NumLinha,0)","v":true},{"$f":"INDEX(PO!A$12:A$167,MATCH($A35,PO!$V$12:$V$167,0))","v":2},{"$f":"IF(ISERROR(J35),I35,SMALL(I35:J35,1))-1","v":2},{"$f":"IF($C35=1,OFFSET(E35,-CFF.NumLinha,0)+1,OFFSET(E35,-CFF.NumLinha,0))","v":1},{"$f":"IF($C35=1,0,IF($C35=2,OFFSET(F35,-CFF.NumLinha,0)+1,OFFSET(F35,-CFF.NumLinha,0)))","v":5},{"$f":"IF(AND($C35<=2,$C35<>0),0,IF($C35=3,OFFSET(G35,-CFF.NumLinha,0)+1,OFFSET(G35,-CFF.NumLinha,0)))","v":0},{"$f":"IF(AND($C35<=3,$C35<>0),0,IF($C35=4,OFFSET(H35,-CFF.NumLinha,0)+1,OFFSET(H35,-CFF.NumLinha,0)))","v":0},{"$f":"MATCH(0,OFFSET($D35,1,$C35,ROW($A$51)-ROW($A35)),0)","v":16},{"$f":"MATCH(OFFSET($D35,0,$C35)+1,OFFSET($D35,1,$C35,ROW($A$51)-ROW($A35)),0)","v":3},{"$f":"ROUND(INDEX(PO!T$12:T$167,MATCH($A35,PO!$V$12:$V$167,0)),2)+10^-12","v":50658.61},null,null,null,"Acumulado (R$)",{"$f":"IF($B35,ROUND(P34*$N33,2),ROUND(SUMIF(OFFSET($B35,1,0,$D35),TRUE,OFFSET(P35,1,0,$D35))/SUMIF(OFFSET($B35,1,0,$D35),TRUE,OFFSET($K35,1,0,$D35))*$N33,2))","v":0},50658.61,50658.61,50658.61,50658.61,50658.61,50658.61,50658.61,null,null,null,null,null,{"$f":"IF($B35,ROUND(AC34*$N33,2),ROUND(SUMIF(OFFSET($B35,1,0,$D35),TRUE,OFFSET(AC35,1,0,$D35))/SUMIF(OFFSET($B35,1,0,$D35),TRUE,OFFSET($K35,1,0,$D35))*$N33,2))","v":0}]
[null,null,null,null,null,null,null,null,null,null,null,{"$f":"INDEX(PO!K$12:K$167,MATCH($A38,PO!$V$12:$V$167,0))","v":"1.6."},{"$f":"INDEX(PO!N$12:N$167,MATCH($A38,PO!$V$12:$V$167,0))","v":"ESTRUTURA: ESCADAS"},{"$f":"IF(ROUND(K38,2)=0,K38,ROUND(K38,2))","v":3542.56},"Parcela (%)",0.5,0.5,{"$f":"IF($B38,0,R37-IF(ISNUMBER(Q37),Q37,0))","v":0},{"$f":"IF($B38,0,S37-IF(ISNUMBER(R37),R37,0))","v":0},{"$f":"IF($B38,0,T37-IF(ISNUMBER(S37),S37,0))","v":0},{"$f":"IF($B38,0,U37-IF(ISNUMBER(T37),T37,0))","v":0},{"$f":"IF($B38,0,V37-IF(ISNUMBER(U37),U37,0))","v":0},{"$f":"IF($B38,0,W37-IF(ISNUMBER(V37),V37,0))","v":0},null,null,null,null,null,{"$f":"IF($B38,0,AC37-IF(ISNUMBER(AB37),AB37,0))","v":0}]
[null,null,null,null,null,null,null,null,null,null,null,null,null,null,"Acumulado (%)",{"$f":"MIN(IF($B38,P36+IF(ISNUMBER(O37),O37,0),P38/$N36),1)","v":0.5},{"$f":"MIN(IF($B38,Q36+IF(ISNUMBER(P37),P37,0),Q38/$N36),1)","v":1},{"$f":"MIN(IF($B38,R36+IF(ISNUMBER(Q37),Q37,0),R38/$N36),1)","v":1},{"$f":"MIN(IF($B38,S36+IF(ISNUMBER(R37),R37,0),S38/$N36),1)","v":1},{"$f":"MIN(IF($B38,T36+IF(ISNUMBER(S37),S37,0),T38/$N36),1)","v":1},{"$f":"MIN(IF($B38,U36+IF(ISNUMBER(T37),T37,0),U38/$N36),1)","v":1},{"$f":"MIN(IF($B38,V36+IF(ISNUMBER(U37),U37,0),V38/$N36),1)","v":1},{"$f":"MIN(IF($B38,W36+IF(ISNUMBER(V37),V37,0),W38/$N36),1)","v":1},null,null,null,null,null,{"$f":"MIN(IF($B38,AC36+IF(ISNUMBER(AB37),AB37,0),AC38/$N36),1)","v":0}]
[{"$f":"OFFSET(A38,-CFF.NumLinha,0)+1","v":7},{"$f":"$C38>=OFFSET($C38,CFF.NumLinha,0)","v":true},{"$f":"INDEX(PO!A$12:A$167,MATCH($A38,PO!$V$12:$V$167,0))","v":2},{"$f":"IF(ISERROR(J38),I38,SMALL(I38:J38,1))-1","v":2},{"$f":"IF($C38=1,OFFSET(E38,-CFF.NumLinha,0)+1,OFFSET(E38,-CFF.NumLinha,0))","v":1},{"$f":"IF($C38=1,0,IF($C38=2,OFFSET(F38,-CFF.NumLinha,0)+1,OFFSET(F38,-CFF.NumLinha,0)))","v":6},{"$f":"IF(AND($C38<=2,$C38<>0),0,IF($C38=3,OFFSET(G38,-CFF.NumLinha,0)+1,OFFSET(G38,-CFF.NumLinha,0)))","v":0},{"$f":"IF(AND($C38<=3,$C38<>0),0,IF($C38=4,OFFSET(H38,-CFF.NumLinha,0)+1,OFFSET(H38,-CFF.NumLinha,0)))","v":0},{"$f":"MATCH(0,OFFSET($D38,1,$C38,ROW($A$51)-ROW($A38)),0)","v":13},{"$f":"MATCH(OFFSET($D38,0,$C38)+1,OFFSET($D38,1,$C38,ROW($A$51)-ROW($A38)),0)","v":3},{"$f":"ROUND(INDEX(PO!T$12:T$167,MATCH($A38,PO!$V$12:$V$167,0)),2)+10^-12","v":3542.5600000000009},null,null,null,"Acumulado (R$)",{"$f":"IF($B38,ROUND(P37*$N36,2),ROUND(SUMIF(OFFSET($B38,1,0,$D38),TRUE,OFFSET(P38,1,0,$D38))/SUMIF(OFFSET($B38,1,0,$D38),TRUE,OFFSET($K38,1,0,$D38))*$N36,2))","v":1771.28},3542.56,3542.56,3542.56,3542.56,3542.56,3542.56,3542.56,null,null,null,null,null,{"$f":"IF($B38,ROUND(AC37*$N36,2),ROUND(SUMIF(OFFSET($B38,1,0,$D38),TRUE,OFFSET(AC38,1,0,$D38))/SUMIF(OFFSET($B38,1,0,$D38),TRUE,OFFSET($K38,1,0,$D38))*$N36,2))","v":0}]
[null,null,null,null,null,null,null,null,null,null,null,{"$f":"INDEX(PO!K$12:K$167,MATCH($A41,PO!$V$12:$V$167,0))","v":"1.7."},{"$f":"INDEX(PO!N$12:N$167,MATCH($A41,PO!$V$12:$V$167,0))","v":"LAJES"},{"$f":"IF(ROUND(K41,2)=0,K41,ROUND(K41,2))","v":153408.95999999999},"Parcela (%)",0.5,0.5,{"$f":"IF($B41,0,R40-IF(ISNUMBER(Q40),Q40,0))","v":0},{"$f":"IF($B41,0,S40-IF(ISNUMBER(R40),R40,0))","v":0},{"$f":"IF($B41,0,T40-IF(ISNUMBER(S40),S40,0))","v":0},{"$f":"IF($B41,0,U40-IF(ISNUMBER(T40),T40,0))","v":0},{"$f":"IF($B41,0,V40-IF(ISNUMBER(U40),U40,0))","v":0},{"$f":"IF($B41,0,W40-IF(ISNUMBER(V40),V40,0))","v":0},null,null,null,null,null,{"$f":"IF($B41,0,AC40-IF(ISNUMBER(AB40),AB40,0))","v":0}]
[null,null,null,null,null,null,null,null,null,null,null,null,null,null,"Acumulado (%)",{"$f":"MIN(IF($B41,P39+IF(ISNUMBER(O40),O40,0),P41/$N39),1)","v":0.5},{"$f":"MIN(IF($B41,Q39+IF(ISNUMBER(P40),P40,0),Q41/$N39),1)","v":1},{"$f":"MIN(IF($B41,R39+IF(ISNUMBER(Q40),Q40,0),R41/$N39),1)","v":1},{"$f":"MIN(IF($B41,S39+IF(ISNUMBER(R40),R40,0),S41/$N39),1)","v":1},{"$f":"MIN(IF($B41,T39+IF(ISNUMBER(S40),S40,0),T41/$N39),1)","v":1},{"$f":"MIN(IF($B41,U39+IF(ISNUMBER(T40),T40,0),U41/$N39),1)","v":1},{"$f":"MIN(IF($B41,V39+IF(ISNUMBER(U40),U40,0),V41/$N39),1)","v":1},{"$f":"MIN(IF($B41,W39+IF(ISNUMBER(V40),V40,0),W41/$N39),1)","v":1},null,null,null,null,null,{"$f":"MIN(IF($B41,AC39+IF(ISNUMBER(AB40),AB40,0),AC41/$N39),1)","v":0}]
[{"$f":"OFFSET(A41,-CFF.NumLinha,0)+1","v":8},{"$f":"$C41>=OFFSET($C41,CFF.NumLinha,0)","v":true},{"$f":"INDEX(PO!A$12:A$167,MATCH($A41,PO!$V$12:$V$167,0))","v":2},{"$f":"IF(ISERROR(J41),I41,SMALL(I41:J41,1))-1","v":2},{"$f":"IF($C41=1,OFFSET(E41,-CFF.NumLinha,0)+1,OFFSET(E41,-CFF.NumLinha,0))","v":1},{"$f":"IF($C41=1,0,IF($C41=2,OFFSET(F41,-CFF.NumLinha,0)+1,OFFSET(F41,-CFF.NumLinha,0)))","v":7},{"$f":"IF(AND($C41<=2,$C41<>0),0,IF($C41=3,OFFSET(G41,-CFF.NumLinha,0)+1,OFFSET(G41,-CFF.NumLinha,0)))","v":0},{"$f":"IF(AND($C41<=3,$C41<>0),0,IF($C41=4,OFFSET(H41,-CFF.NumLinha,0)+1,OFFSET(H41,-CFF.NumLinha,0)))","v":0},{"$f":"MATCH(0,OFFSET($D41,1,$C41,ROW($A$51)-ROW($A41)),0)","v":10},{"$f":"MATCH(OFFSET($D41,0,$C41)+1,OFFSET($D41,1,$C41,ROW($A$51)-ROW($A41)),0)","v":3},{"$f":"ROUND(INDEX(PO!T$12:T$167,MATCH($A41,PO!$V$12:$V$167,0)),2)+10^-12","v":153408.95999999999},null,null,null,"Acumulado (R$)",{"$f":"IF($B41,ROUND(P40*$N39,2),ROUND(SUMIF(OFFSET($B41,1,0,$D41),TRUE,OFFSET(P41,1,0,$D41))/SUMIF(OFFSET($B41,1,0,$D41),TRUE,OFFSET($K41,1,0,$D41))*$N39,2))","v":76704.479999999996},153408.95999999999,153408.95999999999,153408.95999999999,153408.95999999999,153408.95999999999,153408.95999999999,153408.95999999999,null,null,null,null,null,{"$f":"IF($B41,ROUND(AC40*$N39,2),ROUND(SUMIF(OFFSET($B41,1,0,$D41),TRUE,OFFSET(AC41,1,0,$D41))/SUMIF(OFFSET($B41,1,0,$D41),TRUE,OFFSET($K41,1,0,$D41))*$N39,2))","v":0}]
[null,null,null,null,null,null,null,null,null,null,null,{"$f":"INDEX(PO!K$12:K$167,MATCH($A44,PO!$V$12:$V$167,0))","v":"1.8."},{"$f":"INDEX(PO!N$12:N$167,MATCH($A44,PO!$V$12:$V$167,0))","v":"ALVENARIA E FECHAMENTOS"},{"$f":"IF(ROUND(K44,2)=0,K44,ROUND(K44,2))","v":85410.81},"Parcela (%)",0,1,{"$f":"IF($B44,0,R43-IF(ISNUMBER(Q43),Q43,0))","v":0},{"$f":"IF($B44,0,S43-IF(ISNUMBER(R43),R43,0))","v":0},{"$f":"IF($B44,0,T43-IF(ISNUMBER(S43),S43,0))","v":0},{"$f":"IF($B44,0,U43-IF(ISNUMBER(T43),T43,0))","v":0},{"$f":"IF($B44,0,V43-IF(ISNUMBER(U43),U43,0))","v":0},{"$f":"IF($B44,0,W43-IF(ISNUMBER(V43),V43,0))","v":0},null,null,null,null,null,{"$f":"IF($B44,0,AC43-IF(ISNUMBER(AB43),AB43,0))","v":0}]
[null,null,null,null,null,null,null,null,null,null,null,null,null,null,"Acumulado (%)",{"$f":"MIN(IF($B44,P42+IF(ISNUMBER(O43),O43,0),P44/$N42),1)","v":0},{"$f":"MIN(IF($B44,Q42+IF(ISNUMBER(P43),P43,0),Q44/$N42),1)","v":1},{"$f":"MIN(IF($B44,R42+IF(ISNUMBER(Q43),Q43,0),R44/$N42),1)","v":1},{"$f":"MIN(IF($B44,S42+IF(ISNUMBER(R43),R43,0),S44/$N42),1)","v":1},{"$f":"MIN(IF($B44,T42+IF(ISNUMBER(S43),S43,0),T44/$N42),1)","v":1},{"$f":"MIN(IF($B44,U42+IF(ISNUMBER(T43),T43,0),U44/$N42),1)","v":1},{"$f":"MIN(IF($B44,V42+IF(ISNUMBER(U43),U43,0),V44/$N42),1)","v":1},{"$f":"MIN(IF($B44,W42+IF(ISNUMBER(V43),V43,0),W44/$N42),1)","v":1},null,null,null,null,null,{"$f":"MIN(IF($B44,AC42+IF(ISNUMBER(AB43),AB43,0),AC44/$N42),1)","v":0}]
[{"$f":"OFFSET(A44,-CFF.NumLinha,0)+1","v":9},{"$f":"$C44>=OFFSET($C44,CFF.NumLinha,0)","v":true},{"$f":"INDEX(PO!A$12:A$167,MATCH($A44,PO!$V$12:$V$167,0))","v":2},{"$f":"IF(ISERROR(J44),I44,SMALL(I44:J44,1))-1","v":2},{"$f":"IF($C44=1,OFFSET(E44,-CFF.NumLinha,0)+1,OFFSET(E44,-CFF.NumLinha,0))","v":1},{"$f":"IF($C44=1,0,IF($C44=2,OFFSET(F44,-CFF.NumLinha,0)+1,OFFSET(F44,-CFF.NumLinha,0)))","v":8},{"$f":"IF(AND($C44<=2,$C44<>0),0,IF($C44=3,OFFSET(G44,-CFF.NumLinha,0)+1,OFFSET(G44,-CFF.NumLinha,0)))","v":0},{"$f":"IF(AND($C44<=3,$C44<>0),0,IF($C44=4,OFFSET(H44,-CFF.NumLinha,0)+1,OFFSET(H44,-CFF.NumLinha,0)))","v":0},{"$f":"MATCH(0,OFFSET($D44,1,$C44,ROW($A$51)-ROW($A44)),0)","v":7},{"$f":"MATCH(OFFSET($D44,0,$C44)+1,OFFSET($D44,1,$C44,ROW($A$51)-ROW($A44)),0)","v":3},{"$f":"ROUND(INDEX(PO!T$12:T$167,MATCH($A44,PO!$V$12:$V$167,0)),2)+10^-12","v":85410.81},null,null,null,"Acumulado (R$)",{"$f":"IF($B44,ROUND(P43*$N42,2),ROUND(SUMIF(OFFSET($B44,1,0,$D44),TRUE,OFFSET(P44,1,0,$D44))/SUMIF(OFFSET($B44,1,0,$D44),TRUE,OFFSET($K44,1,0,$D44))*$N42,2))","v":0},85410.81,85410.81,85410.81,85410.81,85410.81,85410.81,85410.81,null,null,null,null,null,{"$f":"IF($B44,ROUND(AC43*$N42,2),ROUND(SUMIF(OFFSET($B44,1,0,$D44),TRUE,OFFSET(AC44,1,0,$D44))/SUMIF(OFFSET($B44,1,0,$D44),TRUE,OFFSET($K44,1,0,$D44))*$N42,2))","v":0}]
[null,null,null,null,null,null,null,null,null,null,null,{"$f":"INDEX(PO!K$12:K$167,MATCH($A47,PO!$V$12:$V$167,0))","v":"1.9."},{"$f":"INDEX(PO!N$12:N$167,MATCH($A47,PO!$V$12:$V$167,0))","v":"REVESTIMENTOS"},{"$f":"IF(ROUND(K47,2)=0,K47,ROUND(K47,2))","v":80876.86},"Parcela (%)",{"$f":"IF($B47,0,P46-IF(ISNUMBER(O46),O46,0))","v":0},1,{"$f":"IF($B47,0,R46-IF(ISNUMBER(Q46),Q46,0))","v":0},{"$f":"IF($B47,0,S46-IF(ISNUMBER(R46),R46,0))","v":0},{"$f":"IF($B47,0,T46-IF(ISNUMBER(S46),S46,0))","v":0},{"$f":"IF($B47,0,U46-IF(ISNUMBER(T46),T46,0))","v":0},{"$f":"IF($B47,0,V46-IF(ISNUMBER(U46),U46,0))","v":0},{"$f":"IF($B47,0,W46-IF(ISNUMBER(V46),V46,0))","v":0},null,null,null,null,null,{"$f":"IF($B47,0,AC46-IF(ISNUMBER(AB46),AB46,0))","v":0}]
[null,null,null,null,null,null,null,null,null,null,null,null,null,null,"Acumulado (%)",{"$f":"MIN(IF($B47,P45+IF(ISNUMBER(O46),O46,0),P47/$N45),1)","v":0},{"$f":"MIN(IF($B47,Q45+IF(ISNUMBER(P46),P46,0),Q47/$N45),1)","v":1},{"$f":"MIN(IF($B47,R45+IF(ISNUMBER(Q46),Q46,0),R47/$N45),1)","v":1},{"$f":"MIN(IF($B47,S45+IF(ISNUMBER(R46),R46,0),S47/$N45),1)","v":1},{"$f":"MIN(IF($B47,T45+IF(ISNUMBER(S46),S46,0),T47/$N45),1)","v":1},{"$f":"MIN(IF($B47,U45+IF(ISNUMBER(T46),T46,0),U47/$N45),1)","v":1},{"$f":"MIN(IF($B47,V45+IF(ISNUMBER(U46),U46,0),V47/$N45),1)","v":1},{"$f":"MIN(IF($B47,W45+IF(ISNUMBER(V46),V46,0),W47/$N45),1)","v":1},null,null,null,null,null,{"$f":"MIN(IF($B47,AC45+IF(ISNUMBER(AB46),AB46,0),AC47/$N45),1)","v":0}]
[{"$f":"OFFSET(A47,-CFF.NumLinha,0)+1","v":10},{"$f":"$C47>=OFFSET($C47,CFF.NumLinha,0)","v":true},{"$f":"INDEX(PO!A$12:A$167,MATCH($A47,PO!$V$12:$V$167,0))","v":2},{"$f":"IF(ISERROR(J47),I47,SMALL(I47:J47,1))-1","v":2},{"$f":"IF($C47=1,OFFSET(E47,-CFF.NumLinha,0)+1,OFFSET(E47,-CFF.NumLinha,0))","v":1},{"$f":"IF($C47=1,0,IF($C47=2,OFFSET(F47,-CFF.NumLinha,0)+1,OFFSET(F47,-CFF.NumLinha,0)))","v":9},{"$f":"IF(AND($C47<=2,$C47<>0),0,IF($C47=3,OFFSET(G47,-CFF.NumLinha,0)+1,OFFSET(G47,-CFF.NumLinha,0)))","v":0},{"$f":"IF(AND($C47<=3,$C47<>0),0,IF($C47=4,OFFSET(H47,-CFF.NumLinha,0)+1,OFFSET(H47,-CFF.NumLinha,0)))","v":0},{"$f":"MATCH(0,OFFSET($D47,1,$C47,ROW($A$51)-ROW($A47)),0)","v":4},{"$f":"MATCH(OFFSET($D47,0,$C47)+1,OFFSET($D47,1,$C47,ROW($A$51)-ROW($A47)),0)","v":3},{"$f":"ROUND(INDEX(PO!T$12:T$167,MATCH($A47,PO!$V$12:$V$167,0)),2)+10^-12","v":80876.86},null,null,null,"Acumulado (R$)",{"$f":"IF($B47,ROUND(P46*$N45,2),ROUND(SUMIF(OFFSET($B47,1,0,$D47),TRUE,OFFSET(P47,1,0,$D47))/SUMIF(OFFSET($B47,1,0,$D47),TRUE,OFFSET($K47,1,0,$D47))*$N45,2))","v":0},80876.86,80876.86,80876.86,80876.86,80876.86,80876.86,80876.86,null,null,null,null,null,{"$f":"IF($B47,ROUND(AC46*$N45,2),ROUND(SUMIF(OFFSET($B47,1,0,$D47),TRUE,OFFSET(AC47,1,0,$D47))/SUMIF(OFFSET($B47,1,0,$D47),TRUE,OFFSET($K47,1,0,$D47))*$N45,2))","v":0}]
[null,null,null,null,null,null,null,null,null,null,null,{"$f":"INDEX(PO!K$12:K$167,MATCH($A50,PO!$V$12:$V$167,0))","v":"1.10."},{"$f":"INDEX(PO!N$12:N$167,MATCH($A50,PO!$V$12:$V$167,0))","v":"COBERTURAS"},{"$f":"IF(ROUND(K50,2)=0,K50,ROUND(K50,2))","v":37144.82},"Parcela (%)",{"$f":"IF($B50,0,P49-IF(ISNUMBER(O49),O49,0))","v":0},1,{"$f":"IF($B50,0,R49-IF(ISNUMBER(Q49),Q49,0))","v":0},{"$f":"IF($B50,0,S49-IF(ISNUMBER(R49),R49,0))","v":0},{"$f":"IF($B50,0,T49-IF(ISNUMBER(S49),S49,0))","v":0},{"$f":"IF($B50,0,U49-IF(ISNUMBER(T49),T49,0))","v":0},{"$f":"IF($B50,0,V49-IF(ISNUMBER(U49),U49,0))","v":0},{"$f":"IF($B50,0,W49-IF(ISNUMBER(V49),V49,0))","v":0},null,null,null,null,null,{"$f":"IF($B50,0,AC49-IF(ISNUMBER(AB49),AB49,0))","v":0}]
[null,null,null,null,null,null,null,null,null,null,null,null,null,null,"Acumulado (%)",{"$f":"MIN(IF($B50,P48+IF(ISNUMBER(O49),O49,0),P50/$N48),1)","v":0},{"$f":"MIN(IF($B50,Q48+IF(ISNUMBER(P49),P49,0),Q50/$N48),1)","v":1},{"$f":"MIN(IF($B50,R48+IF(ISNUMBER(Q49),Q49,0),R50/$N48),1)","v":1},{"$f":"MIN(IF($B50,S48+IF(ISNUMBER(R49),R49,0),S50/$N48),1)","v":1},{"$f":"MIN(IF($B50,T48+IF(ISNUMBER(S49),S49,0),T50/$N48),1)","v":1},{"$f":"MIN(IF($B50,U48+IF(ISNUMBER(T49),T49,0),U50/$N48),1)","v":1},{"$f":"MIN(IF($B50,V48+IF(ISNUMBER(U49),U49,0),V50/$N48),1)","v":1},{"$f":"MIN(IF($B50,W48+IF(ISNUMBER(V49),V49,0),W50/$N48),1)","v":1},null,null,null,null,null,{"$f":"MIN(IF($B50,AC48+IF(ISNUMBER(AB49),AB49,0),AC50/$N48),1)","v":0}]
[{"$f":"OFFSET(A50,-CFF.NumLinha,0)+1","v":11},{"$f":"$C50>=OFFSET($C50,CFF.NumLinha,0)","v":true},{"$f":"INDEX(PO!A$12:A$167,MATCH($A50,PO!$V$12:$V$167,0))","v":2},{"$f":"IF(ISERROR(J50),I50,SMALL(I50:J50,1))-1","v":0},{"$f":"IF($C50=1,OFFSET(E50,-CFF.NumLinha,0)+1,OFFSET(E50,-CFF.NumLinha,0))","v":1},{"$f":"IF($C50=1,0,IF($C50=2,OFFSET(F50,-CFF.NumLinha,0)+1,OFFSET(F50,-CFF.NumLinha,0)))","v":10},{"$f":"IF(AND($C50<=2,$C50<>0),0,IF($C50=3,OFFSET(G50,-CFF.NumLinha,0)+1,OFFSET(G50,-CFF.NumLinha,0)))","v":0},{"$f":"IF(AND($C50<=3,$C50<>0),0,IF($C50=4,OFFSET(H50,-CFF.NumLinha,0)+1,OFFSET(H50,-CFF.NumLinha,0)))","v":0},{"$f":"MATCH(0,OFFSET($D50,1,$C50,ROW($A$51)-ROW($A50)),0)","v":1},{"$f":"MATCH(OFFSET($D50,0,$C50)+1,OFFSET($D50,1,$C50,ROW($A$51)-ROW($A50)),0)","v":{"$error":"#N/A"}},{"$f":"ROUND(INDEX(PO!T$12:T$167,MATCH($A50,PO!$V$12:$V$167,0)),2)+10^-12","v":37144.82},null,null,null,"Acumulado (R$)",{"$f":"IF($B50,ROUND(P49*$N48,2),ROUND(SUMIF(OFFSET($B50,1,0,$D50),TRUE,OFFSET(P50,1,0,$D50))/SUMIF(OFFSET($B50,1,0,$D50),TRUE,OFFSET($K50,1,0,$D50))*$N48,2))","v":0},{"$f":"IF($B50,ROUND(Q49*$N48,2),ROUND(SUMIF(OFFSET($B50,1,0,$D50),TRUE,OFFSET(Q50,1,0,$D50))/SUMIF(OFFSET($B50,1,0,$D50),TRUE,OFFSET($K50,1,0,$D50))*$N48,2))","v":37144.82},37144.82,37144.82,37144.82,37144.82,37144.82,37144.82,null,null,null,null,null,{"$f":"IF($B50,ROUND(AC49*$N48,2),ROUND(SUMIF(OFFSET($B50,1,0,$D50),TRUE,OFFSET(AC50,1,0,$D50))/SUMIF(OFFSET($B50,1,0,$D50),TRUE,OFFSET($K50,1,0,$D50))*$N48,2))","v":0}]
[null,null,-1,null,0,0,0,0]
[]
[null,null,null,null,null,null,null,null,null,null,null,{"$f":"DADOS!I32","v":0}]
[null,null,null,null,null,null,null,null,null,null,null,"Local"]
[]
[null,null,null,null,null,null,null,null,null,null,null,{"$f":"PO!K181","v":"2019-03-18"}]
[null,null,null,null,null,null,null,null,null,null,null,"Data"]